{"text_format":"1","workbook":"xlsx","n_sheets":5,"sheets":["Simulador","Tabla de amortizacion","Carat_cont","RECAS","Pol"],"not_rendered":{"charts":0,"images":7,"macros":1,"external_links":0,"defined_names":5,"comments":3,"pivot_tables":0},"unopened":[],"bounds":{"document_bytes":16777216,"sheet_cells":100000,"rows_first":2000,"rows_last":500,"rows_between":2000,"halvings":0,"cell_chars":16384,"cell_head_chars":4096},"cells_cut":0,"cells_raw":0,"read":"whole","date_system":"1900"}

{"sheet":"Simulador","index":0,"n_rows":97,"n_cols":40,"rows_kept":97,"cut":false,"hidden":false,"merged":[[24,13,24,14],[52,20,52,21],[29,6,29,7],[56,2,56,14],[44,13,45,14],[42,13,42,14],[43,13,43,14],[2,2,2,15],[4,2,4,15],[12,2,12,5],[19,8,19,11],[12,10,12,13],[16,2,16,5],[10,12,10,14],[11,2,11,3],[11,6,11,11],[14,2,14,3],[14,6,14,9]]}
[null,null,null,null,null,null,null,null,null,null,null,null,null,null,null,null,null,".",null,null,null,null,null,null,null,null,null,null,null,null,null,null,null,null,null,null,null,null,null,"."]
[]
[null,null,null,null,null,null,null,null,null,null,null,null,null,null,null,null,null,null,null,"7 años","10 años","15 años","20 años",null,null,null,null,null,null,null,{"$f":"IF(OR(U35=4,U35=5),\"SI\",\"\")","v":""}]
[null,null,null,null,null,null,null,null,null,null,null,null,null,null,null,null,null,null,"Tasa",0.10299999999999999,0.10299999999999999,0.105,0.105,null,null,null,null,null,null,null,{"$f":"IF(OR(U35=4,U35=5),\"NO\",\"\")","v":""}]
[null,null,"FINANCIAMIENTO SCOTIABANK - FOVISSSTE",null,null,null,null,null,null,null,null,null,null,null,null,null,null,null,"Pago por mil",16.84,13.47,11.16,10.1]
[null,null,null,null,null,null,null,null,null,null,null,null,null,null,null,null,null,null,"Ingreso Mínimo",{"$f":"$I$26/1000*T5/$AC$35","v":0},{"$f":"$I$26/1000*U5/$AC$35","v":0},{"$f":"$I$26/1000*V5/$AC$35","v":0},{"$f":"$I$26/1000*W5/$AC$35","v":0}]
[]
[null,null,{"$f":"TODAY()","v":"2024-03-22"},null,null,null,null,null,null,null,null,null,null,null,null,null,null,null,"Tasa",{"$f":"IF(T22=1,T4,IF(T22=2,U4,IF(T22=3,V4,W4)))","v":0.105}]
[null,null,null,null,null,null,null,null,null,null,null,null,null,null,null,null,null,null,"PPM",{"$f":"IF(T22=1,T5,IF(T22=2,U5,IF(T22=3,V5,W5)))","v":10.1}]
[null,null,null,null,null,null,null,null,null,null,null,null,null,null,null,null,null,null,"Ingreso Mínimo",{"$f":"IF(T22=1,T6,IF(T22=2,U6,IF(T22=3,V6,W6)))","v":0}]
[null,null,"Nombre del Ejecutivo Especializado / Broker Hipotecario",null,null,null,"Nombre del cliente / Conyuge en su caso"]
[null,null,null,null,null,null,null,null,null,null,null,null,null,null,null,null,null,null,"Contratación de Seguro Daños",null,null,"Daños",3.1E-4,{"$f":"W12","v":3.1E-4}]
[null,null,null,null,null,null,null,null,null,null,null,null,null,null,null,null,null,null,{"$f":"IF(U35=2,\"FOVISSSTE\",\"Externo\")","v":"FOVISSSTE"},1]
[null,null,"Sucursal",null,null,null,"Teléfonos",null,null,null,null,"Fecha Firma",null,null,null,null,null,null,{"$f":"+IF(U35=1,\"Scotiabank\",\"\")","v":""}]
[]
[]
[null,null,null,null,null,null,null,null,null,null,null,null,null,null,null,null,null,null,"Contratación de Seguro Vida",null,null,"Vida",{"$f":"+IF(U35=1,X17,X18)","v":2.5250000000000001E-4},{"$f":"X18*2","v":5.0500000000000002E-4}]
[null,null,null,null,null,null,null,null,null,null,null,null,null,null,null,null,null,null,"Scotiabank",1,null,null,null,2.5250000000000001E-4]
[null,null,"Escoja la opción de su interés:",null,null,null,"Detalle",null,null,null,null,null,null,null,null,null,null,null,"Externo"]
[]
{"$rows_left_out":78}
{"sheet":"Tabla de amortizacion","index":1,"n_rows":258,"n_cols":58,"rows_kept":258,"cut":false,"hidden":false,"merged":[[2,0,2,25],[3,0,3,25],[0,0,0,25],[1,0,1,25],[4,11,4,13]]}
["Scotiabank Inverlat, S.A., Institución de Banca Múltiple, Grupo Financiero Scotiabank Inverlat",null,null,null,null,null,null,null,null,null,null,null,null,null,null,null,null,null,null,null,null,null,null,null,null,null,null,null,null,null,null,null,null,null,null,null,null,null,null,null,null,null,null,null,null,null,null,null,null,null,null,null,null,null,null,null,null,"-"]
[{"$f":"PROPER(\"FINANCIAMIENTO SCOTIABANK - Fovissste\")","v":"Financiamiento Scotiabank - Fovissste"}]
[{"$f":"PROPER(\"TABLA DE AMORTIZACION\")","v":"Tabla De Amortizacion"},null,null,null,null,null,null,null,null,null,null,null,null,null,null,null,null,null,null,null,null,null,null,null,null,null,null,null,null,null,null,null,null,"Comisión por apertura",{"$f":"IFERROR(Simulador!O34*1,0)","v":0}]
[{"$f":"\"Esquema FOVISSSTE - \"&IF(Simulador!T22=1,Simulador!S22,IF(Simulador!T22=2,Simulador!S23,IF(Simulador!T22=3,Simulador!S24,Simulador!S25)))","v":"Esquema FOVISSSTE - 20 años"},null,null,null,null,null,null,null,null,null,null,null,null,null,null,null,null,null,null,null,null,null,null,null,null,null,null,1,null,null,null,null,null,"Avalúo",{"$f":"IFERROR(Simulador!O33*1,0)","v":0}]
["Observaciones",null,null,null,null,null,null,null,null,null,null,{"$f":"Simulador!C8","v":"2024-03-22"},null,null,null,null,null,null,null,null,null,null,null,null,null,null,null,"Disminución de plazo",null,null,null,null,null,"Total",{"$f":"+AI4+AI3","v":0}]
["- En caso de que aplique la comisión por prepagos causa IVA y en la corrida ya lo incluye",null,null,null,null,null,null,null,null,null,null,null,null,null,null,null,null,null,null,null,null,null,null,null,null,null,null,{"$f":"IF(Simulador!U35=2,\"\",\"Disminución de pago\")","v":""}]
["- El escenario que se presenta en la tabla de amortización siempre es considerando que se paga de manera puntual el crédito.",null,null,null,null,null,null,null,null,null,null,null,null,null,null,null,null,null,null,null,null,null,null,null,null,null,null,null,null,null,null,null,null,null,null,null,null,null,null,null,null,null,null,null,null,{"$f":"AT11*12","v":0}]
["- Esta cotización tiene carácter informativo, Scotiabank se reserva el derecho de cambiar cualquier condición sin previo aviso.",null,null,null,null,null,null,null,null,null,null,null,null,null,null,null,null,null,null,null,null,null,null,null,null,null,null,null,null,null,null,null,null,null,null,null,null,null,null,null,null,null,null,null,null,{"$f":"((1+AT11)^12)-1","v":0}]
["- Este documento NO implica que el crédito ha sido autorizado, ni establece obligación alguna para Scotiabank.",null,null,null,null,null,null,null,null,null,null,null,null,null,null,null,null,null,null,null,null,"El crédito se liquida en:",null,null,{"$f":"AD13","v":0},null,null,null,null,null,null,null,null,null,null,null,null,null,null,null,null,null,null,null,null,"Corrida para CAT"]
["- CAT =.",{"$f":"AT8","v":0},"\"Para fines informativos de comparación exclusivamente sin IVA\"",null,null,null,null,null,null,null,null,null,null,null,null,null,null,null,null,null,null,null,null,null,{"$f":"AE13","v":0},null,null,null,null,null,null,null,null,null,null,null,null,null,null,null,null,null,null,null,null,"TIR"]
[{"$f":"IF(Simulador!U35=2,\"\",\"- En caso de anticipos a capital escoja la opción:\")","v":""},null,null,null,null,null,null,null,null,null,null,null,null,null,null,null,null,null,null,null,null,null,null,null,null,null,null,null,null,null,null,null,null,null,null,null,null,null,null,null,null,null,null,null,null,{"$f":"IFERROR(IRR(AT12:AT254,0),0)","v":0}]
[null,null,null,null,null,null,null,null,null,null,null,null,null,null,null,null,null,null,null,null,null,null,null,null,null,".",null,null,null,null,null,null,null,null,null,null,".",null,null,null,null,null,null,null,null,{"$f":"AI5-AL15","v":0}]
["Período","Saldo Inicial",null,"Erogación",null,"Interés",null,"Amortización",null,"Prepagos a capital",null,"Comisión por prepagos",null,"Aportación Bimestral",null,"Tasa aplicada",null,"Saldo Final",null,"Seguro de vida y desempleo",null,"Seguro de daños",null,null,"Pago Mensual",null,"años","meses",{"$f":"SUM(AC15:AC254)","v":1},{"$f":"SUM(AD15:AD254)","v":0},{"$f":"SUM(AE15:AE254)","v":0},{"$f":"AI5-B15","v":0},"Tasa aplicar",null,null,"factor de pago - Valora",null,"Saldo Inicial","Erogación","Interés","Amortización","Saldo Final","Tasa Aplic.","Seguros","Incremento Pago","Pago Mensual",null,"Fecha","Dias","Período","Año actual","Mes actual","Día actual","Dia/corte","sumar a mes"]
[{"$f":"IF(AND(Simulador!U35=2,DAY(Simulador!L15)=3),\"\",IF(AND(Simulador!U35=1,(OR(DAY(Simulador!L15)=3,DAY(Simulador!L15)=17))),\"\",0))","v":0},{"$f":"IF(A14=\"\",\"\",IFERROR(IF(Simulador!O27=\"\",Simulador!I26,Simulador!O27),0))","v":0},null,{"$f":"IF(A14=\"\",\"\",F14+H14)","v":0},null,{"$f":"IFERROR(IF(A14=\"\",\"\",P14/360*AW14*B14),0)","v":0},null,{"$f":"IF(A14=\"\",\"\",0)","v":0},null,null,null,{"$f":"IF(A14=\"\",\"\",IF(Simulador!$T$37<3,0,J14*Simulador!$W$35*1.16))","v":0},null,null,null,{"$f":"IF(A14=\"\",\"\",AG14)","v":0.105},null,{"$f":"IFERROR(IF(A14=\"\",\"\",B14-H14-J14+L14-N14),0)","v":0},null,{"$f":"IFERROR(IF(A14=\"\",\"\",IF(Simulador!$T$18=2,0,IF($B14<=0,0,$B14*Simulador!$W$17/30*AW14))),0)","v":0},null,{"$f":"IFERROR(IF(A14=\"\",\"\",IF($B14<=0,0,IF(Simulador!$T$13=1,0,IF(Simulador!$D$24>0,Simulador!$D$24,Simulador!$N$25)*Simulador!$W$12/30*AW14))),0)","v":0},null,null,{"$f":"IFERROR(IF(B14<=0,0,D14+J14+T14+V14),\"\")","v":0},null,null,null,null,null,null,null,{"$f":"Simulador!T8","v":0.105},null,null,null,null,null,null,null,null,null,null,null,null,{"$f":"IF(A14=\"\",\"\",Y14)","v":0},null,{"$f":"DATE(AY14,AZ14+BC14,BB14)","v":"1900-02-03"},{"$f":"AV14-Simulador!L15","v":34},0,{"$f":"IFERROR(YEAR(Simulador!L15),YEAR(TODAY()))","v":1900},{"$f":"IFERROR(MONTH(Simulador!L15),MONTH(TODAY()))","v":1},{"$f":"IFERROR(DAY(Simulador!L15),DAY(TODAY()))","v":0},{"$f":"IF(Simulador!U35=2,3,IF(AND(DAY(Simulador!L15)>=3,DAY(Simulador!L15)<=16),3,17))","v":3},{"$f":"IF(BA14=BB14,0,1)","v":1}]
[1,{"$f":"IF(A14=\"\",Simulador!I26,'Tabla de amortizacion'!R14)","v":0},null,{"$f":"IFERROR(B15/1000*Simulador!T9,0)","v":0},null,{"$f":"IFERROR(IF(B15=0,0,P15/360*AW15*B15),0)","v":0},null,{"$f":"D15-F15","v":0},null,null,null,{"$f":"IF(Simulador!$T$37<3,0,J15*Simulador!$W$35*1.16)","v":0},null,null,null,{"$f":"IF(B15=0,\"\",AG15)","v":""},null,{"$f":"IFERROR(B15-H15-J15+L15-N15,0)","v":0},null,{"$f":"IFERROR(IF(Simulador!$T$18=2,0,IF($B15<=0,0,$B15*Simulador!$W$17)),0)","v":0},null,{"$f":"IFERROR(IF($B15<=0,0,IF(Simulador!$T$13=1,0,IF(Simulador!$D$24>0,Simulador!$D$24,Simulador!$N$25)*Simulador!$W$12)),0)","v":0},null,null,{"$f":"IF(B15<=0,0,D15+J15+T15+V15)","v":0},null,0,{"$f":"IF(B15=0,0,1)","v":0},{"$f":"IF(R15<=0,IF(R13>0,A15,0),0)","v":1},{"$f":"IF(AC15>0,AA15,0)","v":0},{"$f":"IF(AC15>0,AB15,0)","v":0},{"$f":"Y15","v":0},{"$f":"AG14","v":0.105},null,null,{"$f":"IFERROR((AM15/AL15),0)","v":0},null,{"$f":"B15","v":0},{"$f":"D15","v":0},{"$f":"IFERROR((AQ15/360*AW15*AL15),0)","v":0},{"$f":"+AM15-AN15","v":0},{"$f":"+AL15-AO15","v":0},{"$f":"IF(AL15=0,\"\",AG15)","v":""},{"$f":"IFERROR(IF(Simulador!$T$18=2,0,IF($AL15<=0.01,0,$AL15*Simulador!$W$17)),0)+IFERROR(IF(Simulador!$T$13=1,17,IF($AL15<=0.01,0,IF(Simulador!$D$24>0,Simulador!$D$24,Simulador!$N$25)*Simulador!$W$12)),0)","v":17},null,{"$f":"AN15+AO15+AR15","v":17},null,{"$f":"IF(AL15=0,\"\",DATE(YEAR(AV14),MONTH(AV14)+1,1))","v":""},{"$f":"IFERROR(DAY(DATE(YEAR(AV15),MONTH(AV15),0)),0)","v":0},1]
[2,{"$f":"IF(R15<=0,0,R15)","v":0},null,{"$f":"IF(B16+F16-D15<=0,B16+F16,IF($AB$4=2,B16*AJ16,D15))","v":0},null,0,null,{"$f":"D16-F16","v":0},null,null,null,{"$f":"IF(Simulador!$T$37<3,0,J16*Simulador!$W$35*1.16)","v":0},null,null,null,"",null,{"$f":"B16-H16-J16+L16-N16","v":0},null,{"$f":"IFERROR(IF(Simulador!$T$18=2,0,IF($B16<=0,0,$B16*Simulador!$W$17)),0)","v":0},null,{"$f":"IFERROR(IF($B16<=0,0,IF(Simulador!$T$13=1,0,IF(Simulador!$D$24>0,Simulador!$D$24,Simulador!$N$25)*Simulador!$W$12)),0)","v":0},null,null,{"$f":"IF(B16<=0,0,D16+J16+T16+V16)","v":0},null,0,2,{"$f":"IF(R16<=0,IF(R15>0,A16,0),0)","v":0},{"$f":"IF(AC16>0,AA16,0)","v":0},{"$f":"IF(AC16>0,AB16,0)","v":0},0,{"$f":"AG15","v":0.105},null,null,{"$f":"IFERROR((AM16/AL16),0)","v":0},null,{"$f":"+AP15","v":0},{"$f":"IFERROR((IF(AL16+AN16-AM15<0, AL16+AN16, AM15*(1+AS16))),0)","v":0},0,0,{"$f":"+AL16-AO16","v":0},"",{"$f":"IFERROR(IF(Simulador!$T$18=2,0,IF($AL16<=0.01,0,$AL16*Simulador!$W$17)),0)+IFERROR(IF(Simulador!$T$13=1,17,IF($AL16<=0.01,0,IF(Simulador!$D$24>0,Simulador!$D$24,Simulador!$N$25)*Simulador!$W$12)),0)","v":17},null,{"$f":"AN16+AO16+AR16","v":17},null,{"$f":"IF(AL16=0,\"\",DATE(YEAR(AV15),MONTH(AV15)+1,1))","v":""},{"$f":"IFERROR(DAY(DATE(YEAR(AV16),MONTH(AV16),0)),0)","v":0},2]
[3,{"$f":"IF(R16<=0,0,R16)","v":0},null,{"$f":"IF(B17+F17-D16<=0,B17+F17,IF($AB$4=2,B17*AJ17,D16))","v":0},null,0,null,{"$f":"D17-F17","v":0},null,null,null,{"$f":"IF(Simulador!$T$37<3,0,J17*Simulador!$W$35*1.16)","v":0},null,null,null,"",null,0,null,{"$f":"IFERROR(IF(Simulador!$T$18=2,0,IF($B17<=0,0,$B17*Simulador!$W$17)),0)","v":0},null,{"$f":"IFERROR(IF($B17<=0,0,IF(Simulador!$T$13=1,0,IF(Simulador!$D$24>0,Simulador!$D$24,Simulador!$N$25)*Simulador!$W$12)),0)","v":0},null,null,0,null,0,3,0,0,0,0,{"$f":"AG16","v":0.105},null,null,0,null,0,0,0,0,0,"",{"$f":"IFERROR(IF(Simulador!$T$18=2,0,IF($AL17<=0.01,0,$AL17*Simulador!$W$17)),0)+IFERROR(IF(Simulador!$T$13=1,17,IF($AL17<=0.01,0,IF(Simulador!$D$24>0,Simulador!$D$24,Simulador!$N$25)*Simulador!$W$12)),0)","v":17},null,{"$f":"AN17+AO17+AR17","v":17},null,{"$f":"IF(AL17=0,\"\",DATE(YEAR(AV16),MONTH(AV16)+1,1))","v":""},{"$f":"IFERROR(DAY(DATE(YEAR(AV17),MONTH(AV17),0)),0)","v":0},3,"Días/Mes",{"$f":"365.25/12","v":30.4375}]
[4,0,null,0,null,0,null,0,null,null,null,{"$f":"IF(Simulador!$T$37<3,0,J18*Simulador!$W$35*1.16)","v":0},null,{"$f":"IF(Simulador!U35=1,0,IF(Simulador!$T$54*Simulador!$T$49*2>Simulador!$U$51,Simulador!$U$51,IF(B18=0,0,Simulador!$T$54*Simulador!$T$49*2)))","v":0},null,"",null,0,null,{"$f":"IFERROR(IF(Simulador!$T$18=2,0,IF($B18<=0,0,$B18*Simulador!$W$17)),0)","v":0},null,{"$f":"IFERROR(IF($B18<=0,0,IF(Simulador!$T$13=1,0,IF(Simulador!$D$24>0,Simulador!$D$24,Simulador!$N$25)*Simulador!$W$12)),0)","v":0},null,null,0,null,0,4,0,0,0,0,0.105,null,null,0,null,0,0,0,0,0,"",{"$f":"IFERROR(IF(Simulador!$T$18=2,0,IF($AL18<=0.01,0,$AL18*Simulador!$W$17)),0)+IFERROR(IF(Simulador!$T$13=1,17,IF($AL18<=0.01,0,IF(Simulador!$D$24>0,Simulador!$D$24,Simulador!$N$25)*Simulador!$W$12)),0)","v":17},null,{"$f":"AN18+AO18+AR18","v":17},null,"",0,4,null,"Interés mensual = Sdo inicial x tasa / 360 x # días del mes"]
[5,0,null,0,null,0,null,0,null,null,null,{"$f":"IF(Simulador!$T$37<3,0,J19*Simulador!$W$35*1.16)","v":0},null,null,null,"",null,0,null,{"$f":"IFERROR(IF(Simulador!$T$18=2,0,IF($B19<=0,0,$B19*Simulador!$W$17)),0)","v":0},null,{"$f":"IFERROR(IF($B19<=0,0,IF(Simulador!$T$13=1,0,IF(Simulador!$D$24>0,Simulador!$D$24,Simulador!$N$25)*Simulador!$W$12)),0)","v":0},null,null,0,null,0,5,0,0,0,0,0.105,null,null,0,null,0,0,0,0,0,"",{"$f":"IFERROR(IF(Simulador!$T$18=2,0,IF($AL19<=0.01,0,$AL19*Simulador!$W$17)),0)+IFERROR(IF(Simulador!$T$13=1,17,IF($AL19<=0.01,0,IF(Simulador!$D$24>0,Simulador!$D$24,Simulador!$N$25)*Simulador!$W$12)),0)","v":17},null,{"$f":"AN19+AO19+AR19","v":17},null,"",0,5]
[6,0,null,0,null,0,null,0,null,null,null,{"$f":"IF(Simulador!$T$37<3,0,J20*Simulador!$W$35*1.16)","v":0},null,{"$f":"IF(B20-H20=0,0,N18)","v":0},null,"",null,0,null,{"$f":"IFERROR(IF(Simulador!$T$18=2,0,IF($B20<=0,0,$B20*Simulador!$W$17)),0)","v":0},null,{"$f":"IFERROR(IF($B20<=0,0,IF(Simulador!$T$13=1,0,IF(Simulador!$D$24>0,Simulador!$D$24,Simulador!$N$25)*Simulador!$W$12)),0)","v":0},null,null,0,null,0,6,0,0,0,0,0.105,null,null,0,null,0,0,0,0,0,"",{"$f":"IFERROR(IF(Simulador!$T$18=2,0,IF($AL20<=0.01,0,$AL20*Simulador!$W$17)),0)+IFERROR(IF(Simulador!$T$13=1,17,IF($AL20<=0.01,0,IF(Simulador!$D$24>0,Simulador!$D$24,Simulador!$N$25)*Simulador!$W$12)),0)","v":17},null,17,null,"",0,6]
{"$rows_left_out":239}
{"sheet":"Carat_cont","index":2,"n_rows":47,"n_cols":4,"rows_kept":47,"cut":false,"hidden":false,"merged":[[26,0,26,3],[27,0,27,3],[28,0,28,3],[32,2,34,3],[44,0,44,1],[44,2,44,3],[39,0,39,3],[40,0,40,3],[42,0,42,3],[36,0,36,3],[37,0,37,3],[38,0,38,3],[46,0,46,3],[43,0,43,3],[41,0,41,3],[45,0,45,3],[35,2,35,3],[1,0,1,3],[6,1,6,3],[11,1,14,1],[17,1,17,3],[18,1,18,3],[17,0,19,0],[7,0,7,3],[8,0,8,3],[20,0,20,3],[16,1,16,3],[19,1,19,3],[25,0,25,3],[23,0,23,3],[22,0,22,1],[21,0,21,1],[21,2,21,3],[22,2,22,3],[24,0,24,3]]}
[]
["Carátula de Crédito "]
[null,null,null,"Nombre del Acreditado y/o Coacreditado:"]
[null,null,null,{"$f":"IF(Simulador!G12=\"\",\"\",Simulador!G12)","v":""}]
[null,null,null,"Número de Crédito:"]
[]
["Nombre comercial del producto:",{"$f":"VLOOKUP(Simulador!$T$28,Simulador!$U$27:$W$29,2,0)","v":"Fovissste para todos Individual "}]
[]
["Tipo de Crédito: Crédito Hipotecario "]
["CAT","TASA DE INTERES","MONTO O LINEA DE","MONTO TOTAL A PAGAR O"]
["(Costo Anual Total)","ANUAL ORDINARIA","CRÉDITO","MINIMO A PAGAR"]
[{"$f":"Simulador!I42","v":0},{"$f":"IFERROR(IF(Simulador!D23=0,0,Simulador!I44),0)","v":0},{"$f":"IFERROR(IF(Simulador!O27=\"\",Simulador!I26,Simulador!O27),0)","v":0},{"$f":"IFERROR(SUM('Tabla de amortizacion'!$Y$15:$Y$254),0)","v":0}]
["Sin IVA",null,null,"Moneda en"]
["Para fines",null,null,"Pesos"]
["informativos y de",null,null,"Mexicanos "]
["comparación","Tasa Fija"]
["PLAZO DEL CRÉDITO:","Fecha Límite de pago:"]
[{"$f":"Simulador!T67","v":"20 años"},{"$f":"IF(Simulador!U35=2,\"Tu fecha de pago es el día 3 de cada mes\",IF(AND(DAY(Simulador!L15)>=3,DAY(Simulador!L15)<=16),\"Si tu fecha de corte es el día 3, tu fecha de pago es el día 3 de cada mes.\",\"Si tu fecha de corte es el día 17, tu fecha de pago es el día 17 de cada mes.\"))","v":"Tu fecha de pago es el día 3 de cada mes"}]
[null,"Fecha de corte:"]
[null,{"$f":"IF(Simulador!U35=2,\"Tu fecha de corte será el día 3 de cada mes\",IF(AND(DAY(Simulador!L15)>=3,DAY(Simulador!L15)<=16),\"Si tu fecha de disposición es entre el dia 3 y 16, tu fecha de corte será el día 3 de cada mes.\",\"Si tu fecha de disposición es entre el día 17 y 2, tu fecha de corte será el día 17 de cada mes.\"))","v":"Tu fecha de corte será el día 3 de cada mes"}]
{"$rows_left_out":28}
{"sheet":"RECAS","index":3,"n_rows":4,"n_cols":8,"rows_kept":4,"cut":false,"hidden":false,"merged":[[0,1,0,4]]}
[{"$f":"Simulador!$U$35&\"-\"&Simulador!$T$53&\"-\"&IF(OR(Simulador!$D$44>0,Simulador!$D$46>0),2,1)","v":"2--1"},"RECAS"]
["Clave","No.","Nombre","RECA","Fecha de expedición","Tipo Crédito","Esquema","Mancomunado"]
[null,42,"Fovissste para todos Individual ","0319-138-034644/07-00094-0124","2024-01-15"]
[null,43,"Fovissste para todos Mancomunado ","0319-138-034645/07-00095-0124","2024-01-15"]

{"sheet":"Pol","index":4,"n_rows":177,"n_cols":10,"rows_kept":177,"cut":false,"hidden":true,"merged":[[176,0,176,5],[151,0,152,0],[151,1,152,1],[151,2,152,2],[151,3,152,3],[151,4,152,4],[153,0,160,0],[153,1,153,5],[154,1,154,5],[155,1,155,5],[156,1,156,5],[157,1,157,5],[158,1,158,5],[159,1,159,5],[160,1,160,5],[135,0,135,3],[145,0,150,0],[145,4,150,4],[144,0,144,5],[123,0,123,3],[124,3,126,3],[127,3,132,3],[136,0,136,3],[137,0,137,3],[138,0,138,3],[121,0,121,3],[122,0,122,3],[120,0,120,3],[105,1,106,2],[105,3,106,3],[105,6,105,7],[106,6,106,7],[107,6,112,6],[107,7,112,7],[83,1,83,6],[105,4,105,5],[20,2,21,2],[20,3,21,3],[34,1,34,3],[22,4,23,4],[28,3,32,3],[20,4,21,4],[26,1,26,3],[28,2,29,2],[30,2,32,2],[33,1,33,3],[15,1,15,5],[4,1,4,4],[4,5,6,5],[5,3,6,3],[18,1,18,4],[3,0,6,0],[8,1,9,1],[0,1,0,4],[7,3,8,3],[2,0,2,7],[3,1,3,7],[7,5,11,5],[7,7,11,7],[9,6,11,6],[7,6,8,6],[4,7,6,7],[4,6,6,6]]}
[null,null,null,null,null,null,null,null,null,"http://mxmtyipr1as2029:90/intranet/normatividad/Manuales%20Publicados/92EF8FF4A3C8837A8625798F005DF729.aspx"]
["A) PORCENTAJE DE AFORO VS. PRODUCTO PARA CRÉDITOS MENORES O IGUALES A $5,000,000 ",null,null,null,null,null,null,null,null,"Visión General del Manual de Créditos al Menudeo, Crédito Hipotecario"]
["El Aforo estará alineado al producto que se desee adquirir vs Índice de Riesgo, acorde a lo siguiente:"]
["IR","VALORA Y PAGOS OPORTUNOS"]
[null,"Adquisición (1)",null,null,null,"Liquidez Vivienda Terrenos","Construcción / Renovación II, III y IV ","Renovación I"]
[null,"Empleados ","Empleados ","Independientes","Vivienda"]
[null,"con apoyo","sin apoyo",null,"Descanso"]
[1,0.95,0.95,0.9,0.65,"Hasta el 50% de acuerdo al valor del avalúo de la garantía. ","Hasta el 70% del valor proyectado (o de referencia) de la vivienda o el 100% del valor de construcción, el menor.","Hasta el 70% de acuerdo al valor del avalúo de la garantía."]
[2,0.95,0.9,null,0.65]
[3,null,0.85,0.85,0.5,null,"Nota: en el apartado A.7 se muestra la metodología de cálculo para valor proyectado o de referencia."]
[4,0.85,0.8,0.75,0.5]
[5,0.8,0.7,0.5,0.5]
[]
[]
[]
[null,"B) AFORO PARA CRÉDITOS MAYORES A $5,000,000:"]
[]
[null,"Para créditos que superen los 5,000,000, el Aforo máximo está en función del importe del crédito, como se indica a continuación:"]
[null,"ADQUISICIÓN"]
[null,"Índice de Riesgo / Rango del crédito","Mayor a $5 MDP hasta $6.5 MDP","Mayor a $6.5 MDP hasta $8 MDP","Mayor a $8 MDP"]
{"$rows_left_out":157}