{"text_format":"1","workbook":"xlsx","n_sheets":5,"sheets":["Simulador","Tabla de amortizacion","Carat_cont","RECAS","Pol"],"not_rendered":{"charts":0,"images":7,"macros":1,"external_links":0,"defined_names":5,"comments":3,"pivot_tables":0},"unopened":[],"bounds":{"document_bytes":16777216,"sheet_cells":100000,"rows_first":2000,"rows_last":500,"rows_between":2000,"halvings":0,"cell_chars":16384,"cell_head_chars":4096},"cells_cut":0,"cells_raw":0,"read":"whole","date_system":"1900"}

{"sheet":"Simulador","index":0,"n_rows":112,"n_cols":79,"rows_kept":112,"cut":false,"hidden":false,"merged":[[2,2,2,15],[4,2,4,15],[11,2,11,5],[17,8,17,11],[25,6,25,7],[11,10,11,13],[14,2,14,5],[10,12,10,14],[54,2,54,14],[3,18,3,26],[16,18,16,26],[45,36,45,38],[45,33,45,35],[34,8,35,8],[34,11,35,11],[26,6,26,7],[27,6,27,7]]}
[null,null,null,null,null,null,null,null,null,null,null,null,null,null,null,null,null,".",null,null,null,null,null,null,null,null,null,null,null,null,null,null,null,null,null,null,null,null,null,null,null,null,null,null,null,null,null,null,null,null,null,null,null,null,null,null,null,null,null,null,null,null,null,null,null,null,null,null,null,null,null,null,null,null,null,null,null,null,"-"]
[null,null,null,null,null,null,null,null,null,null,null,null,null,null,null,null,null,null,"CALCULO DE LA PORCION A CON BASE EN EL SSV REMANENTE",null,null,null,null,null,null,null,null,null,null,"CALCULO CRÉDITO COFINAVIT"]
[null,null,null,null,null,null,null,null,null,null,null,null,null,null,null,null,null,null,null,null,null,null,null,null,null,null,null,null,null,null,null,null,null,null,null,{"$f":"IF(OR(U39=4,U39=5),\"SI\",\"\")","v":""}]
[null,null,null,null,null,null,null,null,null,null,null,null,null,null,null,null,null,null,"SSV INFONAVIT",null,null,null,null,null,null,null,null,null,null,"Valor del inmueble",{"$f":"O24","v":0},null,null,null,null,{"$f":"IF(OR(U39=4,U39=5),\"NO\",\"\")","v":""}]
[null,null,"FINANCIAMIENTO RESIDENCIAL SCOTIABANK ",null,null,null,null,null,null,null,null,null,null,null,null,null,null,null,"Uso de la SSV",null,null,"Proyección de Anualidades Garantizadas"]
[null,null,null,null,null,null,null,null,null,null,null,null,null,null,null,null,null,null,"SSV Total",null,null,"Tasa SSV Proyectar",0.05,null,null,null,null,null,null,"Gastos relacionados",{"$f":"O33","v":0}]
[1,null,null,null,null,null,null,null,null,null,null,null,null,null,null,null,null,null,"SSV al frente",null,null,"Año",1,2,3,4,5]
[null,null,{"$f":"TODAY()","v":"2024-03-22"},null,null,null,null,null,null,null,null,null,null,null,null,null,null,null,"SSV Remanente",{"$f":"D36+D43","v":{"$error":"#VALUE!"}},null,"Saldo Inicial",{"$f":"$T$8","v":{"$error":"#VALUE!"}},{"$f":"W12","v":{"$error":"#VALUE!"}},{"$f":"X12","v":{"$error":"#VALUE!"}},{"$f":"Y12","v":{"$error":"#VALUE!"}},{"$f":"Z12","v":{"$error":"#VALUE!"}},null,null,"Valor del inmueble al 95%",{"$f":"AE4*AE17","v":0}]
[null,null,null,null,null,null,null,null,null,null,null,null,null,null,null,null,null,null,null,null,null,"Tasa Efectiva",{"$f":"W6","v":0.05},{"$f":"W9","v":0.05},{"$f":"X9","v":0.05},{"$f":"Y9","v":0.05},{"$f":"Z9","v":0.05}]
[null,null,null,null,null,null,null,null,null,null,null,null,null,null,null,null,null,null,null,null,null,"Intereses",{"$f":"W8*$W$6","v":{"$error":"#VALUE!"}},{"$f":"X8*$W$6","v":{"$error":"#VALUE!"}},{"$f":"Y8*$W$6","v":{"$error":"#VALUE!"}},{"$f":"Z8*$W$6","v":{"$error":"#VALUE!"}},{"$f":"AA8*$W$6","v":{"$error":"#VALUE!"}}]
[null,null,"Nombre del Ejecutivo Especializado / Broker Hipotecario",null,null,null,"Sucursal",null,null,null,"Nombre del Cliente",null,null,null,null,null,null,null,null,null,null,"Anualidad Garantizada",{"$f":"(W8+W10)/5","v":{"$error":"#VALUE!"}},{"$f":"(X8+X10)/4","v":{"$error":"#VALUE!"}},{"$f":"(Y8+Y10)/3","v":{"$error":"#VALUE!"}},{"$f":"(Z8+Z10)/2","v":{"$error":"#VALUE!"}},{"$f":"(AA8+AA10)/1","v":{"$error":"#VALUE!"}},null,null,"Crédito Infonavit Neto",{"$f":"IFERROR((D37+D44),0)","v":0}]
[null,null,null,null,null,null,null,null,null,null,null,null,null,null,null,null,null,null,null,null,null,"Saldo Final",{"$f":"W8+W10-W11","v":{"$error":"#VALUE!"}},{"$f":"X8+X10-X11","v":{"$error":"#VALUE!"}},{"$f":"Y8+Y10-Y11","v":{"$error":"#VALUE!"}},{"$f":"Z8+Z10-Z11","v":{"$error":"#VALUE!"}},{"$f":"AA8+AA10-AA11","v":{"$error":"#VALUE!"}},null,null,"SSV al frente",{"$f":"D35+D42","v":0}]
[null,null,"Teléfonos",null,null,null,null,null,null,null,"Teléfonos",null,null,null,null,null,null,null,null,null,null,"Calculo del Valor Presente de las Anualidades Garantizadas",null,null,null,null,null,null,null,"Cred. Total Infonavit",{"$f":"+AE11+AE12","v":0}]
[null,null,null,null,null,null,null,null,null,null,null,null,null,null,null,null,null,null,null,null,null,"Factor de Descuento",{"$f":"1/(1+$T$20)^1","v":0.90702947845804982},{"$f":"1/(1+$T$20)^2","v":0.82270247479188197},{"$f":"1/(1+$T$20)^3","v":0.74621539663662761},{"$f":"1/(1+$T$20)^4","v":0.67683936202868722},{"$f":"1/(1+$T$20)^5","v":0.61391325354075932}]
[null,null,null,null,null,null,null,null,null,null,null,null,null,null,null,null,null,null,null,null,null,"Valor Presente de la Anualidad",{"$f":"W11*W14","v":{"$error":"#VALUE!"}},{"$f":"X11*X14","v":{"$error":"#VALUE!"}},{"$f":"Y11*Y14","v":{"$error":"#VALUE!"}},{"$f":"Z11*Z14","v":{"$error":"#VALUE!"}},{"$f":"AA11*AA14","v":{"$error":"#VALUE!"}}]
{"$rows_left_out":98}
{"sheet":"Tabla de amortizacion","index":1,"n_rows":258,"n_cols":66,"rows_kept":258,"cut":false,"hidden":false,"merged":[[9,38,9,40],[2,0,2,27],[3,0,3,27],[0,0,0,27],[1,0,1,27],[4,11,4,13]]}
["Scotiabank Inverlat, S.A., Institución de Banca Múltiple, Grupo Financiero Scotiabank Inverlat",null,null,null,null,null,null,null,null,null,null,null,null,null,null,null,null,null,null,null,null,null,null,null,null,null,null,null,null,null,null,null,null,null,null,null,null,null,null,null,null,null,null,null,null,null,null,null,null,null,null,null,null,null,null,null,null,null,null,null,null,null,null,null,null,"-"]
["FINANCIAMIENTO RESIDENCIAL SCOTIABANK"]
["TABLA DE AMORTIZACION",null,null,null,null,null,null,null,null,null,null,null,null,null,null,null,null,null,null,null,null,null,null,null,null,null,null,null,null,null,1,null,null,"Comisión por apertura",null,null,{"$f":"IFERROR(Simulador!O31*1,0)","v":0},null,"Piso","Techo"]
[{"$f":"IF(AND(Simulador!T68=1,Simulador!T62=2),\"VALORA 10 AÑOS\",IF(AND(Simulador!T68=1,Simulador!T62=3),\"VALORA 15 AÑOS\",IF(AND(Simulador!T68=1,Simulador!T62=4),\"VALORA 20 AÑOS\",IF(AND(Simulador!T68=2,Simulador!T62=1),\"PAGOS OPORTUNOS 7 AÑOS\",IF(AND(Simulador!T68=2,Simulador!T62=2),\"PAGOS OPORTUNOS 10 AÑOS\",IF(AND(Simulador!T68=2,Simulador!T62=3),\"PAGOS OPORTUNOS 15 AÑOS\",\"PAGOS OPORTUNOS 20 AÑOS\"))))))","v":"VALORA 20 AÑOS"},null,null,null,null,null,null,null,null,null,null,null,null,null,null,null,null,null,null,null,null,null,null,null,null,null,null,null,null,null,"Disminución de plazo",null,null,"Avalúo",null,null,{"$f":"IFERROR(Simulador!O30*1,0)","v":0},null,{"$f":"Simulador!U53","v":0.1075},{"$f":"Simulador!U54","v":0.1275}]
["Observaciones",null,null,null,null,null,null,null,null,null,null,{"$f":"Simulador!C8","v":"2024-03-22"},null,null,null,null,null,null,null,null,null,null,null,null,null,null,null,null,null,null,"Disminución de pago",null,null,"Total",null,null,{"$f":"+AK4+AK3","v":0}]
["- En caso de que aplique la comisión por prepagos causa IVA y en la corrida ya lo incluye"]
["- El escenario que se presenta en la tabla de amortización siempre es considerando que se paga de manera puntual el crédito."]
["- Para los esquemas de \"Pagos Oportunos\" y \"Valora\" se deberá cumplir con las reglas establecidas en los programas para la disminución de la tasa de interés",null,null,null,null,null,null,null,null,null,null,null,null,null,null,null,null,null,null,null,null,null,null,null,null,null,null,null,null,null,null,null,null,null,null,null,null,null,null,null,null,null,null,null,null,null,null,null,null,null,null,null,null,{"$f":"BB12*12","v":0}]
["- Esta cotización tiene carácter informativo, Scotiabank se reserva el derecho de cambiar cualquier condición sin previo aviso.",null,null,null,null,null,null,null,null,null,null,null,null,null,null,null,null,null,null,null,null,null,null,null,null,null,null,null,null,null,null,null,null,"TIR",null,null,null,null,null,null,null,null,null,null,null,null,null,null,null,null,null,null,null,{"$f":"((1+BB12)^12)-1","v":0}]
["- Este documento NO implica que el crédito ha sido autorizado, ni establece obligación alguna para Scotiabank.",null,null,null,null,null,null,null,null,null,null,null,null,null,null,null,null,"El crédito se liquida",null,null,null,null,null,null,{"$f":"AF14","v":0},"Años",null,null,null,null,null,null,null,{"$f":"IFERROR(IRR(AH14:AH254,0),0)","v":0},null,{"$f":"AH10*12","v":0},{"$f":"((1+AH10)^12)-1","v":0},null,null,null,null,null,null,null,null,null,null,null,null,null,null,null,null,"Corrida para CAT"]
["- CAT =.",{"$f":"BB9","v":0},"\"Para fines informativos de comparación exclusivamente sin IVA\"",null,null,null,null,null,null,null,null,null,null,null,null,null,null,"por pago puntual en:",null,null,null,null,null,null,{"$f":"AG14","v":0},"Meses",null,null,null,null,null,null,null,"Corrida para CAT",null,null,null,null,null,null,null,null,null,null,null,null,null,null,null,null,null,null,null,"TIR"]
["- En caso de anticipos a capital escoja la opción:",null,null,null,null,null,null,null,null,null,null,null,null,null,null,null,null,null,null,null,null,null,null,null,null,null,null,null,null,null,null,null,null,null,null,null,null,null,null,null,null,null,null,null,null,null,null,null,null,null,null,null,null,{"$f":"IFERROR(IRR(BB13:BB254,0),0)","v":0}]
[null,null,null,null,null,null,null,null,null,null,null,null,null,null,null,null,null,null,null,null,null,null,null,null,null,null,null,".",null,null,null,null,null,null,null,null,null,null,null,null,null,null,null,null,".",null,null,null,null,null,null,null,null,{"$f":"AK5-AT15","v":0}]
["Período","Saldo Inicial",null,"Erogación",null,"Interés",null,"Amortización",null,"Prepagos a capital",null,"Comisión por prepagos",null,"Aportación Bimestral (Apoyo Inf)",null,"Tasa aplicada",null,"Saldo Final",null,"Seguro de vida y desempleo",null,"Seguro de daños",null,null,"Pago Mensual",null,"Inc. Pago",null,"años","meses",{"$f":"SUM(AE15:AE254)","v":1},{"$f":"SUM(AF15:AF254)","v":0},{"$f":"SUM(AG15:AG254)","v":0},{"$f":"AK5-B15","v":0},"Tasa aplicar","Tasa Valora","Erogación","7 años","10 años","15 años","20 años","30 años","factor de pago - Valora","Tasa PO",null,"Saldo Inicial","Erogación","Interés","Amortización","Saldo Final","Tasa Aplic.","Seguros","Incremento Pago","Pago Mensual","Plazo","Fecha","Dias","Período","Año actual","Mes actual","Día actual","Dia/corte","sumar a mes"]
[1,{"$f":"IFERROR(IF(Simulador!O25=\"\",Simulador!I25,Simulador!O25),0)","v":0},null,{"$f":"IFERROR(B15/1000*Simulador!T84,0)","v":0},null,{"$f":"IFERROR(IF(B15=0,0,P15/360*BE15*B15),0)","v":0},null,{"$f":"D15-F15","v":0},null,null,null,{"$f":"IF(Simulador!$T$41=1,0,J15*Simulador!$W$39*1.16)","v":0},null,null,null,{"$f":"IF(B15=0,\"\",AI15)","v":""},null,{"$f":"IFERROR(B15-H15-J15+L15-N15,0)","v":0},null,{"$f":"IFERROR(IF(Simulador!$U$29=1,0,IF($B15<=0,0,$B15*Simulador!$AA$43)),0)","v":0},null,{"$f":"IFERROR(IF(Simulador!$U$29=1,0,IF($B15<=0,0,IF(Simulador!$D$22>0,Simulador!$D$22,Simulador!$O$24)*Simulador!$AA$44)),0)","v":0},null,null,{"$f":"IF(B15<=0,0,D15+J15+T15+V15)","v":0},null,null,null,0,{"$f":"IF(B15=0,0,1)","v":0},{"$f":"IF(R15<=0,IF(R14>0,A15,0),0)","v":1},{"$f":"IF(AE15>0,AC15,0)","v":0},{"$f":"IF(AE15>0,AD15,0)","v":0},{"$f":"Y15","v":0},{"$f":"IF(Simulador!$T$68=1,'Tabla de amortizacion'!AJ15,'Tabla de amortizacion'!AR15)","v":0.115},{"$f":"Simulador!$I$42","v":0.115},{"$f":"D15","v":0},{"$f":"Simulador!AD56","v":0.11749999999999999},{"$f":"Simulador!AA56","v":0.11749999999999999},{"$f":"Simulador!X56","v":0.1225},{"$f":"Simulador!U56","v":0.1225},0,{"$f":"IFERROR((AU15/AT15),0)","v":0},{"$f":"IF(AND(Simulador!$T$68=2,Simulador!$T$62=1),AL15,IF(AND(Simulador!$T$68=2,Simulador!$T$62=2),AM15,IF(AND(Simulador!$T$68=2,Simulador!$T$62=3),AN15,AO15)))","v":0.1225},null,{"$f":"B15","v":0},{"$f":"D15","v":0},{"$f":"IFERROR((AY15/360*BE15*AT15),0)","v":0},{"$f":"+AU15-AV15","v":0},{"$f":"+AT15-AW15","v":0},{"$f":"IF(AT15=0,\"\",AI15)","v":""},{"$f":"IFERROR(IF(Simulador!$U$29=1,0,IF($AT15<=0.01,0,$AT15*Simulador!$AA$43)),0)+IFERROR(IF(Simulador!$U$29=1,0,IF($AT15<=0.01,0,IF(Simulador!$D$22>0,Simulador!$D$22,Simulador!$O$24)*Simulador!$AA$44)),0)","v":0},null,{"$f":"AV15+AW15+AZ15","v":0},{"$f":"IF(Simulador!T62=2,120,IF(Simulador!T62=3,180,IF(Simulador!T62=4,240,84)))","v":240},{"$f":"IF(AT15=0,\"\",DATE(BG15,BH15+BK15,BJ15))","v":""},{"$f":"IFERROR(DAY(DATE(YEAR(BD15),MONTH(BD15)+1,0)),0)","v":0},1,{"$f":"IFERROR(YEAR(Simulador!C8),YEAR(TODAY()))","v":2024},{"$f":"IFERROR(MONTH(Simulador!C8),MONTH(TODAY()))","v":3},{"$f":"IFERROR(DAY(Simulador!C8),DAY(TODAY()))","v":22},{"$f":"IF(AND(DAY(Simulador!C8)>=3,DAY(Simulador!C8)<=16),3,17)","v":17},{"$f":"IF(BI15>BJ15,1,0)","v":1}]
{"$rows_left_out":244}
{"sheet":"Carat_cont","index":2,"n_rows":44,"n_cols":4,"rows_kept":44,"cut":false,"hidden":false,"merged":[[33,0,33,3],[17,1,17,3],[25,0,25,3],[26,0,26,3],[30,2,32,3],[24,0,24,3],[23,0,23,3],[21,0,21,3],[22,0,22,3],[20,0,20,1],[20,2,20,3],[19,0,19,1],[19,2,19,3],[34,0,34,3],[35,0,35,3],[39,0,39,3],[36,0,36,3],[37,0,37,3],[43,0,43,3],[40,0,40,3],[38,0,38,3],[42,0,42,3],[41,0,41,3],[7,0,7,3],[8,0,8,3],[18,0,18,3],[16,1,16,3],[1,0,1,3],[6,1,6,3],[11,1,14,1]]}
[]
["Carátula de Crédito "]
[null,null,null,"Nombre del Acreditado y/o Coacreditado:"]
[null,null,null,{"$f":"IF(Simulador!M11=\"\",\"\",Simulador!M11)","v":""}]
[null,null,null,"Número de Crédito:"]
[]
["Nombre comercial del producto:",{"$f":"INDEX(Simulador!AE32:AE38,Simulador!U39)&\" \"&UPPER(INDEX(Simulador!S69:S70,Simulador!T68))&\" \"&A18","v":"CREDIRESIDENCIAL VALORA 20 años"}]
[]
["Tipo de Crédito: Crédito Hipotecario "]
["CAT","TASA DE INTERES","MONTO O LINEA DE","MONTO TOTAL A PAGAR O"]
["(Costo Anual Total)","ANUAL ORDINARIA","CRÉDITO","MINIMO A PAGAR"]
[{"$f":"Simulador!I40","v":0},{"$f":"IFERROR(IF(Simulador!D21=0,0,Simulador!I42),0)","v":0},{"$f":"IFERROR(IF(Simulador!O25=\"\",Simulador!I25,Simulador!O25),0)","v":0},{"$f":"IFERROR(SUM('Tabla de amortizacion'!$Y$15:$Y$254),0)","v":0}]
["Sin IVA",null,null,"Moneda en"]
["Para fines",null,null,"Pesos"]
["informativos y de",null,null,"Mexicanos "]
{"$rows_left_out":30}
{"sheet":"RECAS","index":3,"n_rows":20,"n_cols":8,"rows_kept":20,"cut":false,"hidden":false,"merged":[[0,1,0,4]]}
[{"$f":"Simulador!$U$39&\"-\"&Simulador!$T$68&\"-\"&IF(OR(Simulador!$D$42>0,Simulador!$D$44>0),2,IF(AND(Simulador!U39=7,Simulador!D38>0),2,1))","v":"1-1-1"},"RELACIÓN RECAS"]
["Clave","No.","Nombre","RECA","Fecha de expedición","Tipo Crédito","Esquema","Mancomunado"]
[{"$f":"F3&\"-\"&G3&\"-\"&H3","v":"1-2-1"},9,"Adquisición Pagos Oportunos","0319-138-038229/02-00061-0124","2024-01-15",1,2,1]
["2-2-1",10,"Adquisición Con Apoyo Pagos Oportunos","0319-138-038230/02-00062-0124","2024-01-15",2,2,1]
["1-1-1",11,"Adquisición Valora","0319-138-038232/02-00063-0124","2024-01-15",1,1,1]
["2-1-1",12,"Adquisición Con Apoyo Valora","0319-138-038235/02-00064-0124","2024-01-15",2,1,1]
["4-2-1",21,"Pago de Pasivos Pagos Oportunos","0319-138-007480/24-00073-0124","2024-01-15",4,2,1]
["4-1-1",22,"Pago de Pasivos Valora","0319-138-007481/24-00074-0124","2024-01-15",4,1,1]
["6-2-1",25,"Liquidez Vivienda Pagos Oportunos","0319-138-007482/24-00077-0124","2024-01-15",6,2,1]
["6-1-1",26,"Liquidez Vivienda Valora","0319-138-007483/24-00078-0124","2024-01-15",6,1,1]
[{"$f":"F11&\"-\"&G11&\"-\"&H11","v":"3-2-1"},27,"Cofinavit Pagos Oportunos","0319-138-038237/02-00079-0124","2024-01-15",3,2,1]
["3-2-2",28,"Cofinavit Conyugales Pagos Oportunos","0319-138-038238/02-00080-0124","2024-01-15",3,2,2]
["3-1-1",29,"Cofinavit Valora","0319-138-038239/02-00081-0124","2024-01-15",3,1,1]
["3-1-2",30,"Cofinavit Conyugales Valora","0319-138-038240/02-00082-0124","2024-01-15",3,1,2]
["5-2-1",23,"Pago de Pasivos Pagos Oportunos con Apoyo Infonavit","0319-138-024405/15-00075-0124","2024-01-15",5,2,1]
{"$rows_left_out":6}
{"sheet":"Pol","index":4,"n_rows":177,"n_cols":10,"rows_kept":177,"cut":false,"hidden":true,"merged":[[3,0,6,0],[8,1,9,1],[0,1,0,4],[7,3,8,3],[2,0,2,7],[3,1,3,7],[7,5,11,5],[7,7,11,7],[9,6,11,6],[7,6,8,6],[4,7,6,7],[4,6,6,6],[15,1,15,5],[4,1,4,4],[4,5,6,5],[5,3,6,3],[18,1,18,4],[20,2,21,2],[20,3,21,3],[34,1,34,3],[22,4,23,4],[28,3,32,3],[20,4,21,4],[83,1,83,6],[26,1,26,3],[28,2,29,2],[30,2,32,2],[33,1,33,3],[105,4,105,5],[105,6,105,7],[106,6,106,7],[107,6,112,6],[107,7,112,7],[121,0,121,3],[122,0,122,3],[120,0,120,3],[105,1,106,2],[105,3,106,3],[145,4,150,4],[144,0,144,5],[123,0,123,3],[124,3,126,3],[127,3,132,3],[136,0,136,3],[137,0,137,3],[138,0,138,3],[135,0,135,3],[145,0,150,0],[176,0,176,5],[151,0,152,0],[151,1,152,1],[151,2,152,2],[151,3,152,3],[151,4,152,4],[153,0,160,0],[153,1,153,5],[154,1,154,5],[155,1,155,5],[156,1,156,5],[157,1,157,5],[158,1,158,5],[159,1,159,5],[160,1,160,5]]}
[null,null,null,null,null,null,null,null,null,"http://mxmtyipr1as2029:90/intranet/normatividad/Manuales%20Publicados/92EF8FF4A3C8837A8625798F005DF729.aspx"]
["A) PORCENTAJE DE AFORO VS. PRODUCTO PARA CRÉDITOS MENORES O IGUALES A $5,000,000 ",null,null,null,null,null,null,null,null,"Visión General del Manual de Créditos al Menudeo, Crédito Hipotecario"]
["El Aforo estará alineado al producto que se desee adquirir vs Índice de Riesgo, acorde a lo siguiente:"]
["IR","VALORA Y PAGOS OPORTUNOS"]
[null,"Adquisición (1)",null,null,null,"Liquidez Vivienda Terrenos","Construcción / Renovación II, III y IV ","Renovación I"]
[null,"Empleados ","Empleados ","Independientes","Vivienda"]
[null,"con apoyo","sin apoyo",null,"Descanso"]
[1,0.95,0.95,0.9,0.65,"Hasta el 50% de acuerdo al valor del avalúo de la garantía. ","Hasta el 70% del valor proyectado (o de referencia) de la vivienda o el 100% del valor de construcción, el menor.","Hasta el 70% de acuerdo al valor del avalúo de la garantía."]
[2,0.95,0.9,null,0.65]
[3,null,0.85,0.85,0.5,null,"Nota: en el apartado A.7 se muestra la metodología de cálculo para valor proyectado o de referencia."]
[4,0.85,0.8,0.75,0.5]
[5,0.8,0.7,0.5,0.5]
[]
[]
[]
{"$rows_left_out":162}