{"text_format":"1","workbook":"xlsx","n_sheets":4,"sheets":["Vista Principal","Proceso Prima de Seguro","TarifarioBD","CostoCapBD"],"not_rendered":{"charts":0,"images":0,"macros":1,"external_links":0,"defined_names":5,"comments":3,"pivot_tables":0},"unopened":[],"bounds":{"document_bytes":16777216,"sheet_cells":100000,"rows_first":2000,"rows_last":500,"rows_between":2000,"halvings":0,"cell_chars":16384,"cell_head_chars":4096},"cells_cut":0,"cells_raw":0,"read":"whole","date_system":"1900"}

{"sheet":"Vista Principal","index":0,"n_rows":398,"n_cols":21,"rows_kept":398,"cut":false,"hidden":false,"merged":[[397,1,401,12],[1,1,3,12]]}
[]
[null,"Simulador Préstamo Personal Libre Disponibilidad"]
[]
[]
[]
[]
[null,"1) Establecer los datos del préstamos"]
[]
[null,"Producto",null,null,"Préstamos Personales (LD )"]
[null,"Tipo de Seguro",null,null,"Seguro de Desgravamen"]
[null,"Tarifa",null,null,"TARIFA TITULAR"]
[null,"MAF Inicial",null,null,16000]
[null,"Seguro Desempleo",null,null,0]
[null,"Monto adicional desempleo",null,null,{"$f":"E13*E12","v":0}]
[null,"Prima de Seguro de Desgravamen/Vida",null,null,{"$f":"IF(E10=\"Seguro de vida\",'Proceso Prima de Seguro'!C13,'Proceso Prima de Seguro'!G16)","v":0.12751337792535133}]
[null,"Monto del Seguro (Prima única S/)",null,null,{"$f":"+E15*E12","v":2040.2140468056214}]
[null,"MAF Final",null,null,{"$f":"E12+E14+E16","v":18040.21404680562}]
[null,"Empleado",null,null,{"$f":"IF(OR(E9=\"Préstamos Personales (LD Y PA) (Empleados)\",E9 = \"Préstamos Vehiculares (Empleados)\"),\"SI\",\"NO\")","v":"NO"}]
[null,"Moneda",null,null,"Soles"]
[null,"Plazo ",null,null,24]
[null,"Fecha de Desembolso",null,null,{"$f":"TODAY()+2","v":"2022-08-20"},null,null,{"$f":"E22-E21","v":57},"Días de Periodo de Gracia"]
[null,"Fecha de 1er Pago",null,null,"2022-10-16",null,null,null,{"$f":"IF((DAY(E36)=29)*1+(DAY(E36)=30)*1+(DAY(E36)=31)*1,\" ALERTA: Primera fecha de vencimiento no puede ser 29, 30 o 31, elegir otro periodo de gracia\",IF(H21<40,\" ALERTA: Fecha de 1er Pago de cuota debe ser entre 40 y 60 días.\",IF(H21>60,\" ALERTA: Fecha de 1er Pago de cuota debe ser entre 40 y 60 días.\",\"\")))","v":""}]
[null,"Cuota Julio",null,null,1]
[null,"Cuota Diciembre",null,null,1]
[null,"TEA",null,null,0.39,null,null,{"$f":"SUM(J36:J395)","v":7662.2355377644481},"Total Intereses"]
[null,"TEA TOTAL",null,null,{"$f":"+E25","v":0.39}]
[null,"Monto del Bien",null,null,0]
[null,"Seguro del Bien",null,null,0]
[null,"Portes",null,null,0]
[null,"Cuota",null,null,{"$f":"(E17+(E28*E27+E29)*P34)/O34","v":1070.9353993570871}]
[null,"2) Calcular TCEA presionando el botón "]
[null,"TCEA",0.56739791381500349,null,{"$f":"C32","v":0.56739791381500349}]
[null,null,null,null,null,null,null,null,null,null,null,null,null,null,null,null,null,null,null,null,{"$f":"E17-U34-E14-E16","v":0}]
[null,null,null,null,null,null,null,null,null,null,null,null,null,null,{"$f":"SUM(O36:O395)","v":16.845286893715226},{"$f":"SUM(P36:P395)","v":16.845286893715226},null,null,null,null,{"$f":"SUM(U36:U395)","v":15999.999999999998}]
[null,"N° Cuota","Fecha de pago","Día","Fecha de pago","Días","Dias Acumulados","Saldo Inicial","Amortización","Interés","Seguro del Bien","Portes","Cuota Constante","Saldo Final","Factor Cronograma","Factor Cronograma 2",null,"Vector i,1\nCuota","Vector i,2\nDías Acum","Vector i,3 Factor","Vector i,4\nCalculo VA"]
[null,1,{"$f":"E22","v":"2022-10-16"},{"$f":"IF(B36<=$E$20,WEEKDAY(C36,2),\"\")","v":7},{"$f":"IF(D36=7,C36+1,C36)","v":"2022-10-17"},{"$f":"E36-E21","v":58},{"$f":"F36","v":58},{"$f":"E17","v":18040.21404680562},{"$f":"IF(B36>E$20,\"\",M36-L36-K36-J36)","v":87.976357085337668},{"$f":"IF(B36>E$20,\"\",((1+E$25)^(F36/360)-1)*H36)","v":982.95904227174947},{"$f":"IF(B36>E$20,\"\",E$27*E$28)","v":0},{"$f":"IF(B36>E$20,\"\",E$29)","v":0},{"$f":"IF(B36>E$20,\"\",IF(B36=E$20,H36+J36+K36+L36,IF(AND(E$23=2,MONTH(E36)=7),2*E$30,IF(AND(E$24=2,MONTH(E36)=12),2*E$30,E$30))))","v":1070.9353993570871},{"$f":"IF(B36>E$20,\"\",H36-I36)","v":17952.237689720281},{"$f":"IFERROR(IF(AND(MONTH(E36)=7,E$23=2),2/(1+E$26)^(G36/360),IF(AND(MONTH(E36)=12,E$24=2),2/(1+E$26)^(G36/360),1/(1+E$26)^(G36/360))),\"\")","v":0.94832833420223994},{"$f":"IFERROR(1/(1+E$26)^(G36/360),\"\")","v":0.94832833420223994},null,{"$f":"IFERROR(I36+J36+K36+L36,\"\")","v":1070.9353993570871},{"$f":"G36","v":58},{"$f":"IFERROR((1+C$32)^(S36/360),\"\")","v":1.07509179691831},{"$f":"IFERROR(ROUND(R36/T36,2),\"\")","v":996.13}]
[null,2,{"$f":"IF(B37>$E$20,\"\",EDATE(C36,1))","v":"2022-11-16"},3,{"$f":"IF(D37=7,C37+1,C37)","v":"2022-11-16"},{"$f":"IF(B37>E$20,\"\",E37-E36)","v":30},{"$f":"IFERROR(F37+G36,\"\")","v":88},{"$f":"IF(B37>E$20,\"\",N36)","v":17952.237689720281},571.46863649973227,499.46676285735487,0,0,1070.9353993570871,17380.769053220549,0.92265815915541738,0.92265815915541738,null,{"$f":"IFERROR(I37+J37+K37+L37,\"\")","v":1070.9353993570871},88,1.1161189628386221,959.52]
[null,3,"2022-12-16",5,"2022-12-16",30,118,17380.769053220549,587.3680243576855,483.56737499940169,0,0,1070.9353993570871,16793.401028862863,0.89768284670329823,0.89768284670329823,null,1070.9353993570871,118,1.1587117888711942,924.25]
[null,4,"2023-01-16",1,"2023-01-16",31,149,16793.401028862863,587.91368270132671,483.02171665576049,0,0,1070.9353993570871,16205.487346161537,0.87258504051888264,0.87258504051888264,null,1070.9353993570871,149,1.2044326747710232,889.16]
[null,5,"2023-02-16",4,"2023-02-16",31,180,16205.487346161537,604.82360319782026,466.11179615926687,0,0,1070.9353993570871,15600.663742963718,0.84818892967997084,0.84818892967997084,null,1070.9353993570871,180,1.2519576325958492,855.41]
[null,6,"2023-03-16",4,"2023-03-16",28,208,15600.663742963718,666.20219385525479,404.73320550183234,0,0,1070.9353993570871,14934.461549108462,0.82674052540197174,0.82674052540197174,null,1070.9353993570871,208,1.296493195152868,826.02]
[null,7,"2023-04-16",7,"2023-04-17",32,240,14934.461549108462,627.32120174037141,443.61419761671573,0,0,1070.9353993570871,14307.140347368091,0.802891388432314,0.802891388432314,null,1070.9353993570871,240,1.3493341426418759,793.68]
[null,8,"2023-05-16",2,"2023-05-16",29,269,14307.140347368091,686.32762457293597,384.6077747841511,0,0,1070.9353993570871,13620.812722795155,0.78187290460514436,0.78187290460514436,null,1070.9353993570871,269,1.3990791473419126,765.46]
[null,9,"2023-06-16",5,"2023-06-16",31,300,13620.812722795155,679.16554092855688,391.76985842853026,0,0,1070.9353993570871,12941.647181866598,0.76001296298690824,0.76001296298690824,null,1070.9353993570871,300,1.4542845389456056,736.4]
[null,10,"2023-07-16",7,"2023-07-17",31,331,12941.647181866598,698.7001012543019,372.23529810278524,0,0,1070.9353993570871,12242.947080612295,0.73876419109298175,0.73876419109298175,null,1070.9353993570871,331,1.5116682456702888,708.45]
[null,11,"2023-08-16",3,"2023-08-16",30,361,12242.947080612295,730.31239447737596,340.62300487971117,0,0,1070.9353993570871,11512.634686134919,0.71876668029453639,0.71876668029453639,null,1070.9353993570871,361,1.5693558441705819,682.4]
[null,12,"2023-09-16",6,"2023-09-16",31,392,11512.634686134919,739.80220246801809,331.13319688906904,0,0,1070.9353993570871,10772.832483666902,0.69867108985288173,0.69867108985288173,null,1070.9353993570871,392,1.631280077769218,656.5]
[null,13,"2023-10-16",1,"2023-10-16",30,422,10772.832483666902,771.21389051684275,299.72150884024438,0,0,1070.9353993570871,10001.618593150059,0.67975885394276814,0.67975885394276814,null,1070.9353993570871,422,1.6935322487977564,632.37]
[null,14,"2023-11-16",4,"2023-11-16",31,453,10001.618593150059,783.26293956788413,287.67245978920306,0,0,1070.9353993570871,9218.3556535821735,0.66075386122061697,0.66075386122061697,null,1070.9353993570871,453,1.7603562817096807,608.36]
[null,15,"2023-12-16",6,"2023-12-16",30,483,9218.3556535821735,814.46251075451733,256.47288860256975,0,0,1070.9353993570871,8403.8931428276555,0.64286800178917258,0.64286800178917258,null,1070.9353993570871,483,1.8275342003354094,586]
[null,16,"2024-01-16",2,"2024-01-16",31,514,8403.8931428276555,829.21766240413035,241.71773695295684,0,0,1070.9353993570871,7574.6754804235252,0.62489441950415869,0.62489441950415869,null,1070.9353993570871,514,1.8996457326889131,563.76]
[null,17,"2024-02-16",5,"2024-02-16",31,545,7574.6754804235252,853.0681104513917,217.86728890569543,0,0,1070.9353993570871,6721.6073699721337,0.60742335042443285,0.60742335042443285,null,1070.9353993570871,545,1.9746026690285172,542.35]
[null,18,"2024-03-16",6,"2024-03-16",29,574,6721.6073699721337,890.24363351351678,180.69176584357032,0,0,1070.9353993570871,5831.3637364586166,0.59152192458890396,0.59152192458890396,null,1070.9353993570871,574,2.0473990327662714,523.07000000000005]
[null,19,"2024-04-16",2,"2024-04-16",31,605,5831.3637364586166,903.21027223201202,167.72512712507509,0,0,1070.9353993570871,4928.1534642266042,0.57498389818939566,0.57498389818939566,null,1070.9353993570871,605,2.1281860744340881,503.22]
[null,20,"2024-05-16",4,"2024-05-16",30,635,4928.1534642266042,933.82442187426432,137.11097748282285,0,0,1070.9353993570871,3994.3290423523399,0.55941973461513894,0.55941973461513894,null,1070.9353993570871,635,2.2094009469085911,484.72]
[null,21,"2024-06-16",7,"2024-06-17",32,667,3994.3290423523399,952.28759492746872,118.64780442961847,0,0,1070.9353993570871,3042.041447424871,0.54328204997958884,0.54328204997958884,null,1070.9353993570871,667,2.2994491167364286,465.74]
[null,22,"2024-07-16",2,"2024-07-16",29,696,3042.041447424871,989.15855482431743,81.776844532769744,0,0,1070.9353993570871,2052.8828926005535,0.52905974650790299,0.52905974650790299,null,1070.9353993570871,696,2.3842213784799808,449.18]
[null,23,"2024-08-16",5,"2024-08-16",31,727,2052.8828926005535,1011.8891694020638,59.046229955023357,0,0,1070.9353993570871,1040.9937231984898,0.51426806476128695,0.51426806476128695,null,1070.9353993570871,727,2.4782988830435717,432.13]
[null,24,"2024-09-16",1,"2024-09-16",31,758,1040.9937231984898,1040.9937231984898,29.941676158569877,0,0,1070.9353993570596,0,0.49988993526531439,0.49988993526531439,null,1070.9353993570596,758,2.5760885331926353,415.72]
[null,25,"","","","","","","","","","","","","","",null,"","","",""]
{"$rows_left_out":339}
{"sheet":"Proceso Prima de Seguro","index":1,"n_rows":396,"n_cols":24,"rows_kept":396,"cut":false,"hidden":true,"merged":[[1,2,3,8]]}
[]
[null,null,"Proceso de Cálculo de la Prima de Seguros"]
[]
[]
[]
[]
[null,"1) Datos esenciales del préstamo",null,null,null,"3) Calculo del valor presente del Seguro"]
[]
[null,"Producto",{"$f":"'Vista Principal'!E9","v":"Préstamos Personales (LD )"},null,null,"Suma de Prima Mensual",{"$f":"SUM(K37:K396)","v":2091.8483291411135}]
[null,"Tipo de Seguro",{"$f":"'Vista Principal'!E10","v":"Seguro de Desgravamen"},null,null,"VPN - Valor Presente",{"$f":"NPV(C16,K37:K396)","v":2040.2140468056211}]
[null,"Tarifa",{"$f":"'Vista Principal'!E11","v":"TARIFA TITULAR"}]
[null,"Monto inicial",{"$f":"'Vista Principal'!E12","v":16000},null,null,"4) Calculo del Monto Adicional del Seguro y MAF"]
[null,{"$f":"C10","v":"Seguro de Desgravamen"},{"$f":"INDEX(_xlfn._xlws.FILTER(TarifarioPrincipal[],(TarifarioPrincipal[TARIFA]='Proceso Prima de Seguro'!C11)*(TarifarioPrincipal[PRODUCTO]='Proceso Prima de Seguro'!C9)*(TarifarioPrincipal[TIPO_SEGURO]='Proceso Prima de Seguro'!C10)*(TarifarioPrincipal[Plazo]='Proceso Prima de Seguro'!C19)),0,5)","v":8.3140000000000002E-3}]
[null,"Monto adicional Seguro de Desgravamen/ Vida",null,null,null,"Monto inicial",{"$f":"C12","v":16000}]
[null,"MAF Inicial",{"$f":"C12+C14","v":16000},null,null,"Monto adicional de Desgravamen / Vida",{"$f":"G10","v":2040.2140468056211}]
[null,"Costo Capital",{"$f":"INDEX(_xlfn._xlws.FILTER(Tabla2[],Tabla2[TARIFA]=C11),0,2)","v":2.8709999999999999E-3},null,null,"Prima de Seguro de Desgravamen / Vida",{"$f":"G15/G14","v":0.12751337792535133}]
[null,"Moneda",{"$f":"'Vista Principal'!E19","v":"Soles"},null,null,"MAF Inicial",{"$f":"G14+G15","v":18040.21404680562}]
[null,"Plazo Remanente Meses",{"$f":"'Vista Principal'!E20","v":24}]
[null,"Plazo Rango",{"$f":"IF(C18<=12,\"0-12\",IF(AND(C18>12,C18<=18),\"13-18\",IF(AND(C18>18,C18<=24),\"19-24\",IF(AND(C18>24,C18<=36),\"25-36\",IF(AND(C18>36,C18<=48),\"37-48\",\"49-84\")))))","v":"19-24"}]
[null,"Fecha de Desembolso",{"$f":"'Vista Principal'!E21","v":"2022-08-20"}]
[null,"Fecha de 1er Pago",{"$f":"'Vista Principal'!E22","v":"2022-10-16"}]
[null,"Cuota Julio",{"$f":"'Vista Principal'!E23","v":1}]
[null,"Cuota Diciembre",{"$f":"'Vista Principal'!E24","v":1}]
[null,"TEA",{"$f":"'Vista Principal'!E25","v":0.39}]
[null,"TEA TOTAL",{"$f":"(1+(((1+C24)^(30/360)-1)+C13))^12-1","v":0.5310911604200621}]
[null,"Monto del Bien",0]
[null,"Seguro del Bien",0]
[null,"Portes",0]
[null,"Cuota",{"$f":"(C15+(C27*C26+C28)*Q35)/P35","v":1046.5422174474136}]
[]
[null,"TCEA",0.9236764757563436]
[null,null,null,null,null,null,null,null,null,null,null,null,null,null,null,null,null,null,null,null,null,{"$f":"C15-V35-C14","v":3123.1200000000026}]
[]
[null,"2) Creación de Cronograma de prima mensual"]
[null,null,null,null,null,null,null,null,null,null,null,null,null,null,null,{"$f":"SUM(P37:P396)","v":15.288442007647879},{"$f":"SUM(Q37:Q396)","v":15.288442007647879},null,null,null,null,{"$f":"SUM(V37:V396)","v":12876.879999999997}]
[null,"N° Cuota","Fecha de pago","Día","Fecha de pago","Días","Dias Acumulados","Saldo Inicial","Amortización","Interés","Seguro Desgravamen","Seguro del Bien","Portes","Cuota Constante","Saldo Final","Factor Cronograma","Factor Cronograma 2",null,"Vector i,1\nCuota","Vector i,2\nDías Acum","Vector i,3 Factor","Vector i,4\nCalculo VA","VPN - Valor Presente","VPN - Valor Presente"]
[null,1,{"$f":"C21","v":"2022-10-16"},{"$f":"IF(B37<=$C$18,WEEKDAY(C37,2),\"\")","v":7},{"$f":"IF(D37=7,C37+1,C37)","v":"2022-10-17"},{"$f":"E37-C20","v":58},{"$f":"F37","v":58},{"$f":"C15","v":16000},{"$f":"IF(B37>C$18,\"\",N37-M37-L37-K37-J37)","v":-83.428839698324623},{"$f":"IF(B37>C$18,\"\",((1+C$24)^(F37/360)-1)*H37)","v":871.79368468373752},{"$f":"IF(B37>C$18,\"\",((1+C$13)^(F37/30)-1)*H37)","v":258.17737246200068},{"$f":"IF(B37>C$18,\"\",C$26*C$27)","v":0},{"$f":"IF(B37>C$18,\"\",C$28)","v":0},{"$f":"IF(B37>C$18,\"\",IF(B37=C$18,H37+J37+K37+L37+M37,IF(AND(C$22=2,MONTH(E37)=7),2*C$29,IF(AND(C$23=2,MONTH(E37)=12),2*C$29,C$29))))","v":1046.5422174474136},{"$f":"IF(B37>C$18,\"\",H37-I37)","v":16083.428839698325},{"$f":"IFERROR(IF(AND(MONTH(E37)=7,C$22=2),2/(1+C$25)^(G37/360),IF(AND(MONTH(E37)=12,C$23=2),2/(1+C$25)^(G37/360),1/(1+C$25)^(G37/360))),\"\")","v":0.93367187212903624},{"$f":"IFERROR(1/(1+C$25)^(G37/360),\"\")","v":0.93367187212903624},null,{"$f":"IFERROR(I37+J37+K37+L37+M37,\"\")","v":1046.5422174474136},{"$f":"G37","v":58},{"$f":"IFERROR((1+C$31)^(T37/360),\"\")","v":1.1111605849390616},{"$f":"IFERROR(ROUND(S37/U37,2),\"\")","v":941.85},{"$f":"K37/(1+$H$9)","v":258.17737246200068},{"$f":"K37/(1+$P$29)","v":258.17737246200068}]
[null,2,{"$f":"IF(B38>$C$18,\"\",EDATE(C37,1))","v":"2022-11-16"},3,{"$f":"IF(D38=7,C38+1,C38)","v":"2022-11-16"},{"$f":"IF(B38>C$18,\"\",E38-E37)","v":30},{"$f":"IFERROR(F38+G37,\"\")","v":88},{"$f":"IF(B38>C$18,\"\",O37)","v":16083.428839698325},465.35178601193491,447.47280406222785,{"$f":"IF(B38>C$18,\"\",((1+C$13)^(F38/30)-1)*H38)","v":133.71762737325079},0,0,1046.5422174474136,15618.077053686389,0.90110940254283933,0.90110940254283933,null,1046.5422174474136,88,1.1734227318565009,891.87,{"$f":"IF(N38=\"\",0,K38/((1+$H$9)^B38))","v":133.71762737325079},{"$f":"IF(N38=\"\",0,K38/((1+$P$29)^B38))","v":133.71762737325079}]
[null,3,"2022-12-16",5,"2022-12-16",30,118,15618.077053686389,482.16772793434291,434.52579688872311,129.84869262434759,0,0,1046.5422174474136,15135.909325752047,0.86968257220765055,0.86968257220765055,null,1046.5422174474136,118,1.2391736408766576,844.55,129.84869262434759,129.84869262434759]
[null,4,"2023-01-16",1,"2023-01-16",31,149,15135.909325752047,481.14167035408229,435.34796156569473,130.05258552763652,0,0,1046.5422174474136,14654.767655397965,0.83835917443884422,0.83835917443884422,null,1046.5422174474136,149,1.3109891333991677,798.28,130.05258552763652,130.05258552763652]
[null,5,"2023-02-16",4,"2023-02-16",31,180,14654.767655397965,499.1146746706948,421.50908073568183,125.91846204103689,0,0,1046.5422174474136,14155.652980727271,0.80816395294853016,0.80816395294853016,null,1046.5422174474136,180,1.386966645509669,754.55,125.91846204103689,125.91846204103689]
[null,6,"2023-03-16",4,"2023-03-16",28,208,14155.652980727271,569.48366607169453,367.24481094244175,109.81374043327726,0,0,1046.5422174474136,13586.169314655577,0.78182671275714366,0.78182671275714366,null,1046.5422174474136,208,1.4593691967937219,717.12,109.81374043327726,109.81374043327726]
[null,7,"2023-04-16",7,"2023-04-17",32,240,13586.169314655577,522.45870122601184,403.56443915887758,120.51907706252412,0,0,1046.5422174474136,13063.710613429565,0.75277635146391664,0.75277635146391664,null,1046.5422174474136,240,1.54675438562731,676.61,120.51907706252412,120.51907706252412]
[null,8,"2023-05-16",2,"2023-05-16",29,269,13063.710613429565,590.3838077482269,351.18161613473796,104.97679356444868,0,0,1046.5422174474136,12473.326805681338,0.72738292998796417,0.72738292998796417,null,1046.5422174474136,269,1.6304585778622964,641.87,104.97679356444868,104.97679356444868]
[null,9,"2023-06-16",5,"2023-06-16",31,300,12473.326805681338,580.60220365470195,358.76519090644723,107.17482288626442,0,0,1046.5422174474136,11892.724602026636,0.70118474507042994,0.70118474507042994,null,1046.5422174474136,300,1.7249507312976253,606.71,107.17482288626442,107.17482288626442]
[null,10,"2023-07-16",7,"2023-07-17",31,331,11892.724602026636,602.29054734948363,342.0655674876167,102.18610261031327,0,0,1046.5422174474136,11290.434054677153,0.67593014140106267,0.67593014140106267,null,1046.5422174474136,331,1.824919115274519,573.47,102.18610261031327,102.18610261031327]
[null,11,"2023-08-16",3,"2023-08-16",30,361,11290.434054677153,638.55134033201387,314.1222083848146,93.868668730585085,0,0,1046.5422174474136,10651.882714345138,0.65235659770891197,0.65235659770891197,null,1046.5422174474136,361,1.927175606017391,543.04,93.868668730585085,93.868668730585085]
[null,12,"2023-09-16",6,"2023-09-16",31,392,10651.882714345138,648.64208573758651,306.37574041469793,91.524391295129121,0,0,1046.5422174474136,10003.240628607551,0.6288606397006119,0.6288606397006119,null,1046.5422174474136,392,2.0388637994699192,513.29999999999995,91.524391295129121,91.524391295129121]
[null,13,"2023-10-16",1,"2023-10-16",30,422,{"$f":"IF(B49>C$18,\"\",O48)","v":10003.240628607551},{"$f":"IF(B49>C$18,\"\",N49-M49-L49-K49-J49)","v":685.06533371579883},278.30994114537225,83.166942586242499,0,0,1046.5422174474136,{"$f":"IF(B49>C$18,\"\",H49-I49)","v":9318.1752948917529},0.60692867830660147,0.60692867830660147,null,{"$f":"IFERROR(I49+J49+K49+L49+M49,\"\")","v":1046.5422174474136},422,2.1531083462508929,486.06,83.166942586242499,{"$f":"IF(N49=\"\",0,K49/((1+$P$29)^B49))","v":83.166942586242499}]
[null,14,"2023-11-16",4,"2023-11-16",31,453,9318.1752948917529,698.46260780813031,268.01486008118519,80.064749558098129,0,0,1046.5422174474136,8619.7126870836219,0.58506889979036092,0.58506889979036092,null,1046.5422174474136,453,2.2778903229163618,459.43,80.064749558098129,80.064749558098129]
[null,15,"2023-12-16",6,"2023-12-16",30,483,8619.7126870836219,735.06046903499202,239.81745713200891,71.664291280412655,0,0,1046.5422174474136,7884.6522180486299,0.56466420642435966,0.56466420642435966,null,1046.5422174474136,483,2.4055283474013729,435.06,71.664291280412655,71.664291280412655]
[null,16,"2024-01-16",2,"2024-01-16",31,514,7884.6522180486299,752.01173488561722,226.7830228701078,67.747459691688476,0,0,1046.5422174474136,7132.6404831630125,0.54432666936329221,0.54432666936329221,null,1046.5422174474133,514,2.5449391590478139,411.22,67.747459691688476,67.747459691688476]
[null,17,"2024-02-16",5,"2024-02-16",31,545,7132.6404831630125,780.10306637909582,205.15321729913208,61.285933769185718,0,0,1046.5422174474136,6352.5374167839163,0.5247216303231802,0.5247216303231802,null,1046.5422174474136,545,2.6924294324993561,388.7,61.285933769185718,61.285933769185718]
[null,18,"2024-03-16",6,"2024-03-16",29,574,6352.5374167839163,824.72443141839562,170.77034409268052,51.047441936337471,0,0,1046.5422174474136,5527.8129853655209,0.50702118384869488,0.50702118384869488,null,1046.5422174474136,574,2.8381329992008397,368.74,51.047441936337471,51.047441936337471]
[null,19,"2024-04-16",2,"2024-04-16",31,605,5527.8129853655209,840.05125487024475,158.99422117974967,47.496741397419115,0,0,1046.5422174474136,4687.7617304952764,0.48875977822044486,0.48875977822044486,null,1046.5422174474136,605,3.0026151286284826,348.54,47.496741397419115,47.496741397419115]
[null,20,"2024-05-16",4,"2024-05-16",30,635,4687.7617304952764,877.14536247526337,130.42280394481281,38.97405102733741,0,0,1046.5422174474136,3810.6163680200129,0.47171393386297439,0.47171393386297439,null,1046.5422174474136,635,3.1708619750421754,330.05,38.97405102733741,38.97405102733741]
[null,21,"2024-06-16",7,"2024-06-17",32,667,3810.6163680200129,899.5485226928165,113.19079144338053,33.802903311216554,0,0,1046.5422174474136,2911.0678453271967,0.45418644345855597,0.45418644345855597,null,1046.5422174474136,667,3.3607291951144314,311.39999999999998,33.802903311216554,33.802903311216554]
[null,22,"2024-07-16",2,"2024-07-16",29,696,2911.0678453271967,944.89360334800188,78.255982611014858,23.392631488396926,0,0,1046.5422174474136,1966.1742419791949,0.43886536201786236,0.43886536201786236,null,1046.5422174474136,696,3.5425984855535217,295.42,23.392631488396926,23.392631488396926]
[null,23,"2024-08-16",5,"2024-08-16",31,727,1966.1742419791949,973.0959534555659,56.552264545631289,16.893999446216299,0,0,1046.5422174474136,993.078288523629,0.42305872780356368,0.42305872780356368,null,1046.5422174474133,727,3.7479074484439354,279.23,16.893999446216299,16.893999446216299]
[null,24,"2024-09-16",1,"2024-09-16",31,758,993.078288523629,993.07828852362911,28.56350413307128,8.5328470377475032,0,0,1030.1746396944479,-1.1368683772161603E-13,0.40782140187104837,0.40782140187104837,null,1030.1746396944479,758,3.9651149571094439,259.81,8.5328470377475032,8.5328470377475032]
{"$rows_left_out":337}
{"sheet":"TarifarioBD","index":2,"n_rows":19,"n_cols":9,"rows_kept":19,"cut":false,"hidden":true,"merged":[]}
["TARIFA","PRODUCTO","TIPO_SEGURO","Plazo","Valor",null,"TARIFA","PRODUCTO","TIPO_SEGURO"]
["TARIFA TITULAR","Préstamos Personales (LD )","Seguro de Vida","0-12",5.3999999999999999E-2,null,"TARIFA TITULAR","Préstamos Personales (LD )","Seguro de Vida"]
["TARIFA TITULAR","Préstamos Personales (LD )","Seguro de Vida","13-18",5.8999999999999997E-2,null,null,null,"Seguro de Desgravamen"]
["TARIFA TITULAR","Préstamos Personales (LD )","Seguro de Vida","19-24",6.4000000000000001E-2,null,null,null,"Seguro de Desgravamen con Devolución"]
["TARIFA TITULAR","Préstamos Personales (LD )","Seguro de Vida","25-36",6.8000000000000005E-2]
["TARIFA TITULAR","Préstamos Personales (LD )","Seguro de Vida","37-48",7.3999999999999996E-2]
["TARIFA TITULAR","Préstamos Personales (LD )","Seguro de Vida","49-84",8.1000000000000003E-2]
["TARIFA TITULAR","Préstamos Personales (LD )","Seguro de Desgravamen","0-12",8.3140000000000002E-3]
["TARIFA TITULAR","Préstamos Personales (LD )","Seguro de Desgravamen","13-18",8.3140000000000002E-3]
["TARIFA TITULAR","Préstamos Personales (LD )","Seguro de Desgravamen","19-24",8.3140000000000002E-3]
["TARIFA TITULAR","Préstamos Personales (LD )","Seguro de Desgravamen","25-36",8.3140000000000002E-3]
["TARIFA TITULAR","Préstamos Personales (LD )","Seguro de Desgravamen","37-48",8.3140000000000002E-3]
["TARIFA TITULAR","Préstamos Personales (LD )","Seguro de Desgravamen","49-84",8.3140000000000002E-3]
["TARIFA TITULAR","Préstamos Personales (LD )","Seguro de Desgravamen con Devolución","0-12",1.0843999999999999E-2]
["TARIFA TITULAR","Préstamos Personales (LD )","Seguro de Desgravamen con Devolución","13-18",1.0843999999999999E-2]
["TARIFA TITULAR","Préstamos Personales (LD )","Seguro de Desgravamen con Devolución","19-24",1.0843999999999999E-2]
["TARIFA TITULAR","Préstamos Personales (LD )","Seguro de Desgravamen con Devolución","25-36",1.0843999999999999E-2]
["TARIFA TITULAR","Préstamos Personales (LD )","Seguro de Desgravamen con Devolución","37-48",1.0843999999999999E-2]
["TARIFA TITULAR","Préstamos Personales (LD )","Seguro de Desgravamen con Devolución","49-84",1.0843999999999999E-2]

{"sheet":"CostoCapBD","index":3,"n_rows":2,"n_cols":2,"rows_kept":2,"cut":false,"hidden":true,"merged":[]}
["TARIFA","CostoCapital"]
["TARIFA TITULAR",2.8709999999999999E-3]