{"text_format":"1","workbook":"xlsx","n_sheets":12,"sheets":["Hoja1","Apertura","Solicitud-DJ","Trama","Tablas_Ayuda","Rangos","Ubigeo","Columnas","Hoja2","Hoja3","Profesion","Ocupacion"],"not_rendered":{"charts":0,"images":4,"macros":1,"external_links":0,"defined_names":278,"comments":2,"pivot_tables":0},"unopened":[],"bounds":{"document_bytes":16777216,"sheet_cells":100000,"rows_first":2000,"rows_last":500,"rows_between":2000,"halvings":0,"cell_chars":16384,"cell_head_chars":4096},"cells_cut":0,"cells_raw":0,"read":"whole","date_system":"1900"}

{"sheet":"Hoja1","index":0,"n_rows":16,"n_cols":19,"rows_kept":16,"cut":false,"hidden":true,"merged":[]}
[]
[]
[]
[]
[]
[]
[]
[1,2,3,4,5,6,7,8,9,1,"DPT 2","OF 3","PSO 4","MZ 5","LT 6","INT 7","SEC 8","KM 9","1 DPT 2 OF 3 PSO 4 MZ 5 LT 6 INT 7 SEC 8 KM 9"]
[null,null,null,22,33,44,null,null,null,null,null,null,"PSO 22","MZ 33","LT 44",null,null,null,"PSO 22 MZ 33 LT 44"]
[3,3,3,3,3,3,3,3,3,3,"DPT 3","OF 3","PSO 3","MZ 3","LT 3","INT 3","SEC 3","KM 3","3 DPT 3 OF 3 PSO 3 MZ 3 LT 3 INT 3 SEC 3 KM 3"]
[1,2,3,4,5,6,7,8,9,1,"DPT 2","OF 3","PSO 4","MZ 5","LT 6","INT 7","SEC 8","KM 9","1 DPT 2 OF 3 PSO 4 MZ 5 LT 6 INT 7 SEC 8 KM 9"]
[null,null,null,22,33,44,null,null,null,null,null,null,"PSO 22","MZ 33","LT 44",null,null,null,"PSO 22 MZ 33 LT 44"]
[3,3,3,3,3,3,3,3,3,3,"DPT 3","OF 3","PSO 3","MZ 3","LT 3","INT 3","SEC 3","KM 3","3 DPT 3 OF 3 PSO 3 MZ 3 LT 3 INT 3 SEC 3 KM 3"]
[1,2,3,4,5,6,7,8,9,1,"DPT 2","OF 3","PSO 4","MZ 5","LT 6","INT 7","SEC 8","KM 9","1 DPT 2 OF 3 PSO 4 MZ 5 LT 6 INT 7 SEC 8 KM 9"]
[null,null,null,22,33,44,null,null,null,null,null,null,"PSO 22","MZ 33","LT 44",null,null,null,"PSO 22 MZ 33 LT 44"]
[3,3,3,3,3,3,3,3,3,3,"DPT 3","OF 3","PSO 3","MZ 3","LT 3","INT 3","SEC 3","KM 3","3 DPT 3 OF 3 PSO 3 MZ 3 LT 3 INT 3 SEC 3 KM 3"]

{"sheet":"Apertura","index":1,"n_rows":16,"n_cols":32,"rows_kept":16,"cut":false,"hidden":false,"merged":[[7,5,7,6],[8,5,8,6],[3,2,3,3],[6,5,6,6]]}
[".",".",null,null,null,"N° de cuentas Solicitadas",{"$f":"COUNTIF(C17:C516,\"*\")","v":0}]
[null,null,null,null,null,null,"Archivo no validado"]
[]
[null,null,"¿Lo solicita una empresa?",null,"NO"]
[]
[null,null,"DATOS CONTACTO DE LA EMPRESA",null,null,null,null,null,"Para ser llenado por Scotiabank"]
[null,null,"T/DOI",null,"Nombres y Apellidos",null,null,null,"Canal de Venta","Código de Vendedor",null,"Código de Vendedor 1"]
[null,null,"Nro DOI",null,"Nombre de cargo en la empresa"]
[null,null,"Celular",null,"Dirección electrónica"]
[]
[null,null,"DATOS DE LA EMPRESA"]
[null,null,"Fecha de Envío","¿Apertura Centralizada?","Tipo de Cuenta","Número de RUC","Nombre de la Empresa","Departamento / Provincia / Distrito"]
[null,null,null,"NO"]
[]
[null,null,"DATOS DE LOS COLABORADORES"]
[null,null,"Tipo de Documento","Número de Documento","Apellido Paterno","Apellido Materno","Primer Nombre","Segundo Nombre","País de Nacimiento","Nacionalidad","Residencia","Fecha de Nacimiento","Sexo","Estado Civil","Vía ","Nombre de la Vía","Núm / Dep / Ofi / Piso / Mzn / Lote / Int / Sec / Km","Zona","Nombre de la Zona","Referencia","Departamento ","Provincia","Distrito","Dirección Electrónica","Código de Área","Teléfono Fijo","Télefono Celular","Situación Laboral","Fecha de Ingreso a la empresa","Moneda de la Cta de abono","Ingresos Brutos Mensuales","Ocupación / Cargo / Profesión"]

{"sheet":"Solicitud-DJ","index":2,"n_rows":207,"n_cols":11,"rows_kept":207,"cut":false,"hidden":false,"merged":[[1,1,1,8],[15,6,15,7],[14,2,14,3],[15,2,15,3],[11,1,11,8],[14,6,14,7],[3,1,3,2],[13,1,13,4],[10,1,10,8],[13,5,13,8],[9,7,9,8],[9,1,9,3],[9,4,9,5],[47,1,47,3],[30,1,30,8],[26,1,26,2],[37,1,37,2],[37,5,37,8],[36,5,36,8],[37,3,37,4],[36,3,36,4],[36,1,36,2],[26,3,26,4],[33,5,33,8],[33,1,33,2],[33,3,33,4],[17,6,17,8],[23,1,23,8],[17,2,17,3],[21,1,21,3],[20,1,20,3],[19,1,19,8],[25,1,25,2],[25,3,25,4],[32,5,32,8],[32,3,32,4],[32,1,32,2]]}
[null,null,null,null,null,null,null,null,null,null," Lima"]
[null,"SOLICITUD DE APERTURAS MASIVAS Y EXONERACIÓN DEL ITF",null,null,null,null,null,null,null,null,"Provincia"]
[]
[null,{"$f":"Apertura!C13","v":"00:00:00"},null,null,null,null,null,null,null,null,"Ahorros"]
[null,null,null,null,null,null,null,null,null,null,"CTS"]
[null,"Señores:"]
[null,"SCOTIABANK PERU SAA",null,null,null,null,null,null,null,null,1]
[null,"Presente.-"]
[]
[null,"Conste el presente documento como solicitud de apertura masiva de",null,null,{"$f":"Apertura!E13","v":0},null,"para cada","trabajador"]
[null,"por parte de mi representada, y para tal efecto, se indica la información necesaria, declarando y asumiendo la responsabilidad por la misma que es vertida de manera fiel y veraz en todos sus extremos.",null,null,null,null,null,null,null,null,"trabajador"]
[null," ",null,null,null,null,null,null,null,null,"pensionista"]
[]
[null,"Resumen de cuentas solicitadas",null,null,null,"Sectorización de cuentas solicitadas"]
[null,null,"CON exoneración",null,"Total","Localidad","Agencia",null,"CDR"]
[null,{"$f":"COUNTIF(LISTA,\"=INDEPENDIENTE\")","v":0},{"$f":"COUNTIF(LISTA,\"=DEPENDIENTE\")","v":0},null,{"$f":"SUM(B16:D16)","v":0}," Lima",null,null,{"$f":"VLOOKUP(G16,Columnas!F8:H203,3,FALSE)","v":{"$error":"#N/A"}}]
[]
[null,"Para ello asumimos la entrega","completamente descentralizada de los",null,"documentos por cada ","trabajador","al Banco, según lo requerido."]
[]
[null,{"$f":"IF(op>=2,\"Por esta modalidad asumimos la responsabilidad de informar a nuestros trabajores/pensionistas que deban acercarse a regularizar su cuenta en la Red de Agencias y Sucursales, para la obtención de sus respectivas Scotiacards Débito, considerando: \",\" \")","v":" "}]
[null,{"$f":"IF(op=2,\"Cuentas con documentación centralizada (Lima):\",IF(op=3,\"Cuentas con documentación descentralizada (Red para Lima):\",\" \"))","v":" "},null,null," ",null,null,null,null,null,"completamente centralizada de los"]
[null,{"$f":"IF(op>=2,\"Cuentas con documentación descentralizada (Red para Provincia):\",\" \")","v":" "},null,null," ",null,null,null,null,null,"centralizada y descentralizada de los"]
[null,null,null,null,null,null,null,null,null,null,"completamente descentralizada de los"]
[null,"Para la entrega de la información que proporcionamos, y para la recepción de documentación y tarjetas Scotiacard (si fuese el caso) acreditamos a:"]
[]
[null,"Nombres y Apellidos",null,"Documento de identidad (3)(4)"]
[]
[]
[]
[]
{"$rows_left_out":178}
{"sheet":"Trama","index":3,"n_rows":0,"n_cols":0,"rows_kept":0,"cut":false,"hidden":true,"merged":[]}

{"sheet":"Tablas_Ayuda","index":4,"n_rows":243,"n_cols":29,"rows_kept":243,"cut":false,"hidden":true,"merged":[]}
[null,2,3,4,5,6,7,8,9,10,11,12,13,14,15]
["Tipo de documento",null,null,"Tipo de Residencia",null,null,"Estado Civil",null,null,null,"Tipo de Vía",null,null,"Tipo de Zona",null,null,"CDR Empresa",null,null,null,null,"Ocupación","C4",null,"Cargo","C4",null,"Profesion","C3"]
[]
[1,"LIB.ELEC/D.N.I.",null,1,"RESIDENTE EN EL PAIS",null,"C","CASADO",null,null,1,"AVENIDA",null,1,"URBANIZACION",null,"016","RED AGENCIA",{"$f":"CONCATENATE(Q4,\" - \",R4)","v":"016 - RED AGENCIA"},null,null,0,"TIPO DE OCUPACION   ",null,0,"CARGO ACTUAL     ",null,1,"AUXILIAR DE ADMINISTRACION             "]
[2,"CARNET EXTRANJERIA",null,2,"RESID. CASA MATRIZ EXTERIOR",null,"S","SOLTERO",null,null,2,"JIRON",null,2,"PUEBLO JOVEN",null,"003","FFVV INTERNA HIPOTECARIO",{"$f":"CONCATENATE(Q5,\" - \",R5)","v":"003 - FFVV INTERNA HIPOTECARIO"},null,null,1,"DEPENDIENTE         ",null,1,"GERENTE GENERAL      ",null,2,"ANTROPOLOGO, ARQUEOLOGO Y ETNOLOGO     "]
[7,"PASAPORTE",null,3,"NO RESID CON NACIONAL PERUANA",null,"D","DIVORCIADO",null,null,3,"CALLE",null,3,"UNIDAD VECINAL",null,"014","FFVV INTERNA PP LIMA",{"$f":"CONCATENATE(Q6,\" - \",R6)","v":"014 - FFVV INTERNA PP LIMA"},null,null,2,"INDEPENDIENTE       ",null,2,"GERENTE PRODUCCION    ",null,3,"ABOGADO                                "]
[null,null,null,4,"OTROS NO RESIDENTES",null,"V","VIUDO",null,null,4,"PASAJE",null,4,"CONJUNTO HABITACIONAL",null,"030","FFVV INTERNA PP LIMA ASESORES DE CONVENIOS",{"$f":"CONCATENATE(Q7,\" - \",R7)","v":"030 - FFVV INTERNA PP LIMA ASESORES DE CONVENIOS"},null,null,3,"ESTUDIANTE          ",null,3,"GERENTE RR.HH        ",null,4,"AMA DE CASA                            "]
[null,null,null,null,null,null,"E","CONVIVIENTE",null,null,5,"ALAMEDA",null,5,"ASENTAMIENTO HUMANO",null,"036","FFVV INTERNA PAYROLL",{"$f":"CONCATENATE(Q8,\" - \",R8)","v":"036 - FFVV INTERNA PAYROLL"},null,null,4,"JUBILADO            ",null,4,"GERENTE FINANZAS     ",null,5,"ACTOR,ARTISTA Y DIRECTOR DE ESPECTACULOS"]
[null,null,null,null,null,null,"O","OTROS",null,null,6,"MALECON",null,6,"COOPERATIVA",null,"102","BURO PROVINCIA","102 - BURO PROVINCIA",null,null,5,"SU CASA             ",null,5,"GERENTE INFORMATICA  ",null,6,"ADMINISTRADOR                          "]
[null,null,null,null,null,null,"N","NO REGISTRADO",null,null,7,"OVALO",null,7,"RESIDENCIAL",null,"238","PROFUTURO AFP",{"$f":"CONCATENATE(Q10,\" - \",R10)","v":"238 - PROFUTURO AFP"},null,null,7,"RENTISTA            ",null,6,"EMPLEADO             ",null,7,"ADMINISTRADOR DE EMPRESAS(PROFESIONAL) "]
[null,null,null,null,null,null,null,null,null,null,8,"PARQUE",null,8,"ZONA INDUSTRIAL",null,"319","BURO LIMA","319 - BURO LIMA",null,null,8,"OTROS - BACK OFFICE",null,7,"FUNCIONARIO          ",null,8,"AGRICULTOR                             "]
[null,null,null,null,null,null,null,null,null,null,9,"PLAZA",null,9,"GRUPO",null,"342","MF PAYROLL LIMA","342 - MF PAYROLL LIMA",null,null,null,null,null,8,"GERENTE              ",null,9,"AGRONOMO                               "]
[null,null,null,null,null,null,null,null,null,null,10,"CARRETERA",null,10,"CASERIO",null,"378","BURO PAYROLL PROVINCIA","378 - BURO PAYROLL PROVINCIA",null,null,null,null,null,9,"GERENTE MARKETING    ",null,10,"AGRIMENSOR Y TOPOGRAFO                 "]
[null,null,null,null,null,null,null,null,null,null,11,"BLOCK",null,11,"FUNDO",null,"380","ODISEC PRESTAMOS (MULTIPRODUCTO)","380 - ODISEC PRESTAMOS (MULTIPRODUCTO)",null,null,null,null,null,10,"GERENTE OPERACIONES  ",null,11,"ALBA¥IL                                "]
[null,null,null,null,null,null,null,null,null,null,99,"----------",null,99,"------------------",null,"398","TCONTAKTO PAYROLL (MULTIPRODUCTO)","398 - TCONTAKTO PAYROLL (MULTIPRODUCTO)",null,null,null,null,null,11,"GERENTE PRODUCTOS    ",null,12,"ARCHIVERO                              "]
["Países",null,null,"Códigos de Área (Teléfono fijo)",null,null,null,null,null,null,null,null,null,null,null,null,"400","GSS PAYROLL (MULTIPRODUCTO)","400 - GSS PAYROLL (MULTIPRODUCTO)",null,null,null,null,null,12,"GERENTE VENTAS       ",null,13,"ARQUITECTO                             "]
[589,"PERU",null,null,null,null,null,null,null,null,null,null,null,null,null,null,"999","USUARIO GENERICO","999 - USUARIO GENERICO",null,null,null,null,null,13,"JEFE                 ",null,14,"ANALISTAS DE SISTEMA Y COMPUTACION     "]
[17,"ALBANIA",null,"001","LIMA         ","001 - LIMA         ",null,null,null,null,null,null,null,null,null,null,null,null,null,null,null,null,null,null,14,"SUB GERENTE          ",null,15,"ASESOR                                 "]
[20,"ALBORAN Y PEREJIL, ISLAS",null,"041","AMAZONAS     ","041 - AMAZONAS     ",null,null,null,null,null,null,null,null,null,null,null,null,null,null,null,null,null,null,15,"OTROS                ",null,16,"ARTESANO DE CUERO"]
[23,"GERMANY",null,"042","SAN MARTIN   ","042 - SAN MARTIN   ",null,null,null,null,null,null,null,null,null,null,null,null,null,null,null,null,null,null,16,"GERENTE ADMINISTRACION",null,17,"ARTESANO TEXTIL"]
[25,"ALEMANIA ORIENTAL R.D.A.",null,"043","ANCASH       ","043 - ANCASH       ",null,null,null,null,"Rango Dolares","Rango Dolares",null,null,null,null,null,null,null,null,null,null,null,null,17,"CONTADOR GENERAL     ",null,18,"BACTERIOLOGO, FARMACOLOGO"]
[31,"ALTO VOLTA",null,"044","LA LIBERTAD  ","044 - LA LIBERTAD  ",null,null,null,null,null,null,null,null,null,null,null,null,null,null,null,null,null,null,18,"AUDITOR INTERNO      ",null,19,"BIOLOGO"]
[37,"ANDORRA",null,"051","PUNO         ","051 - PUNO         ",null,null,null,1,"0-450","0-1575",null,450,null,null,null,null,null,null,null,null,null,null,19,"NO INFORMADO         ",null,20,"COMERCIALIZACION DE ARROZ"]
[40,"ANGOLA",null,"052","TACNA        ","052 - TACNA        ",null,null,null,2,"451-1200","1576-4200",null,1200,null,null,null,null,null,null,null,null,null,null,20,"ASESOR               ",null,21,"CAMBISTA"]
[43,"ANTIGUA, ISLA",null,"053","MOQUEGUA     ","053 - MOQUEGUA     ",null,null,null,3,"1201-2000","4201-7000",null,2000,null,null,null,null,null,null,null,null,null,null,21,"PRACTICANTE        ",null,22,"FOTOGRAFO Y OPERADORES CAMARA, CINE Y TV"]
[47,"ANTILLAS HOLANDESAS",null,"054","AREQUIPA     ","054 - AREQUIPA     ",null,null,null,4,"2001-5000","7001-17500",null,5000,null,null,null,null,null,null,null,null,null,null,null,null,null,23,"CIRUJANO PLASTICO"]
[53,"ARABIA SAUDITA",null,"056","ICA          ","056 - ICA          ",null,null,null,5,"5001-10000","17501-35000",null,10000,null,null,null,null,null,null,null,null,null,null,null,null,null,24,"COREOGRAFO Y BAILARINES"]
[59,"ARGELIA",null,"061","UCAYALI      ","061 - UCAYALI      ",null,null,null,6,"10001-1000000","35001-3500000",null,1000000,null,null,null,null,null,null,null,null,null,null,null,null,null,26,"COSMETOLOGO, PELUQUERO Y BARBERO"]
[63,"ARGENTINA",null,"062","HUANUCO      ","062 - HUANUCO      ",null,null,null,null,null,null,null,null,null,null,null,null,null,null,null,null,null,null,null,null,null,27,"CARPINTERO"]
[69,"AUSTRALIA",null,"063","PASCO        ","063 - PASCO        ",null,null,null,null,null,null,null,null,null,null,null,null,null,null,null,null,null,null,null,null,null,28,"CONFECCIONISTA DE ROPA"]
{"$rows_left_out":214}
{"sheet":"Rangos","index":5,"n_rows":6,"n_cols":7,"rows_kept":6,"cut":false,"hidden":true,"merged":[]}
[null,null,"0-450",450,null,"0-1575",450]
[null,null,"10001-1000000",1000000,null,"1576-4200",1200]
[null,null,"1201-2000",2000,null,"17501-35000",10000]
[null,null,"2001-5000",5000,null,"35001-3500000",1000000]
[null,null,"451-1200",1200,null,"4201-7000",2000]
[null,null,"5001-10000",10000,null,"7001-17500",5000]

{"sheet":"Ubigeo","index":6,"n_rows":1834,"n_cols":28,"rows_kept":1834,"cut":false,"hidden":true,"merged":[[0,0,0,2],[0,4,0,7],[0,9,0,13]]}
["Tabla de Departamentos",null,null,null,"Tabla de Provincias",null,null,null,null,"Tabla de Distritos"]
["País","Cód.Dpto","Descripción",null,"País","Cod.Dpto","Cod.Provincia","Descripción",null,"País","Cod.Dpto","Cod.Provincia","Cod.Distrito","Descripción"]
[589,1,"AMAZONAS",null,589,1,1,"CHACHAPOYAS",null,589,1,1,1,"CHACHAPOYAS"]
[589,2,"ANCASH",null,589,1,2,"BAGUA",null,589,1,1,2,"ASUNCION",null,null,null,null,null,null,null,null,null,null,null,null,"ANCASH",{"$error":"#VALUE!"}]
[589,3,"APURIMAC",null,589,1,3,"BONGARA",null,589,1,1,3,"BALSAS",null,null,null,null,null,null,null,null,null,null,null,null,"APURIMAC",{"$error":"#VALUE!"}]
[589,4,"AREQUIPA",null,589,1,4,"CONDORCANQUI",null,589,1,1,4,"CHETO",null,null,null,null,null,null,null,null,null,null,null,null,"AREQUIPA",{"$error":"#VALUE!"}]
[589,5,"AYACUCHO",null,589,1,5,"LUYA",null,589,1,1,5,"CHILIQUIN",null,null,null,null,null,null,null,null,null,null,null,null,"AYACUCHO",{"$error":"#VALUE!"}]
[589,6,"CAJAMARCA",null,589,1,6,"RODRIGUEZ DE ME",null,589,1,1,6,"CHUQUIBAMBA",null,null,null,null,null,null,null,null,null,null,null,null,"CAJAMARCA",{"$error":"#VALUE!"}]
[589,7,"CALLAO",null,589,1,7,"UTCUBAMBA",null,589,1,1,7,"GRANADA",null,null,null,null,null,null,null,null,null,null,null,null,"CALLAO",{"$error":"#VALUE!"}]
[589,8,"CUZCO",null,589,2,1,"HUARAZ",null,589,1,1,8,"HUANCAS",null,null,null,null,null,null,null,null,null,null,null,null,"CUZCO",{"$error":"#VALUE!"}]
[589,9,"HUANCAVELICA",null,589,2,2,"AIJA",null,589,1,1,9,"LA JALCA",null,null,null,null,null,null,null,null,null,null,null,null,"HUANCAVELICA"]
[589,10,"HUANUCO",null,589,2,3,"ANTONIO RAYMOND",null,589,1,1,10,"LEIMEBAMBA",null,null,null,null,null,null,null,null,null,null,null,null,"HUANUCO"]
[589,11,"ICA",null,589,2,4,"ASUNCION",null,589,1,1,11,"LEVANTO",null,null,null,null,null,null,null,null,null,null,null,null,"ICA"]
[589,12,"JUNIN",null,589,2,5,"BOLOGNESI",null,589,1,1,12,"MAGDALENA",null,null,null,null,null,null,null,null,null,null,null,null,"JUNIN"]
[589,13,"LA LIBERTAD",null,589,2,6,"CARHUAZ",null,589,1,1,13,"MARISCAL CASTIL",null,null,null,null,null,null,null,null,null,null,null,null,"LA LIBERTAD"]
[589,14,"LAMBAYEQUE",null,589,2,7,"CARLOS F. FITZC",null,589,1,1,14,"MOLINOPAMPA",null,null,null,null,null,null,null,null,null,null,null,null,"LAMBAYEQUE"]
[589,15,"LIMA",null,589,2,8,"CASMA",null,589,1,1,15,"MONTEVIDEO",null,null,null,null,null,null,null,null,null,null,null,null,"LIMA"]
[589,16,"LORETO",null,589,2,9,"CORONGO",null,589,1,1,16,"OLLEROS",null,null,null,null,null,null,null,null,null,null,null,null,"LORETO"]
[589,17,"MADRE DE DIOS",null,589,2,10,"HUARI",null,589,1,1,17,"QUINJALCA",null,null,null,null,null,null,null,null,null,null,null,null,"MADRE DE DIOS"]
[589,18,"MOQUEGUA",null,589,2,11,"HUARMEY",null,589,1,1,18,"SAN FRANCISCO D",null,null,null,null,null,null,null,null,null,null,null,null,"MOQUEGUA"]
[589,19,"PASCO",null,589,2,12,"HUAYLAS",null,589,1,1,19,"SAN ISIDRO DE M",null,null,null,null,null,null,null,null,null,null,null,null,"PASCO"]
[589,20,"PIURA",null,589,2,13,"MARISCAL LUZURI",null,589,1,1,20,"SOLOCO",null,null,null,null,null,null,null,null,null,null,null,null,"PIURA"]
[589,21,"PUNO",null,589,2,14,"OCROS",null,589,1,1,21,"SONCHE",null,null,null,null,null,null,null,null,null,null,null,null,"PUNO"]
[589,22,"SAN MARTIN",null,589,2,15,"PALLASCA",null,589,1,2,1,"LA PECA",null,null,null,null,null,null,null,null,null,null,null,null,"SAN MARTIN"]
[589,23,"TACNA",null,589,2,16,"POMABAMBA",null,589,1,2,2,"ARAMANGO",null,null,null,null,null,null,null,null,null,null,null,null,"TACNA"]
[589,24,"TUMBES",null,589,2,17,"RECUAY",null,589,1,2,3,"COPALLIN",null,null,null,null,null,null,null,null,null,null,null,null,"TUMBES"]
[589,25,"UCAYALI",null,589,2,18,"SANTA",null,589,1,2,4,"EL PARCO",null,null,null,null,null,null,null,null,null,null,null,null,"UCAYALI"]
[null,null,null,null,589,2,19,"SIHUAS",null,589,1,2,5,"IMAZA"]
[null,null,null,null,589,2,20,"YUNGAY",null,589,1,3,1,"JUMBILLA"]
[null,null,null,null,589,3,1,"ABANCAY",null,589,1,3,2,"CHISQUILLA"]
{"$rows_left_out":1805}
{"sheet":"Columnas","index":7,"n_rows":508,"n_cols":8,"rows_kept":508,"cut":false,"hidden":true,"merged":[]}
[]
[]
[]
[]
[]
[]
[null,"B8","AI","AJ",null,"Agencia","UBIGEO","CDR"]
[null,1,0,1,null,"AGENCIA ALFONSO UGARTE","Lima",203]
[null,1,0,1,null,"AGENCIA ANGAMOS","Lima",43]
[null,1,0,1,null,"AGENCIA ANTUNEZ DE MAYOLO","Lima",372]
[null,1,0,1,null,"AGENCIA ARENALES","Lima",391]
[null,1,0,1,null,"AGENCIA ASIA","Lima",103]
[null,1,1,0,null,"AGENCIA ATE","Lima",98]
[null,1,1,0,null,"AGENCIA AVIACION","Lima",48]
[null,0,0,0,null,"AGENCIA BARRANCO","Lima",51]
[null,0,0,0,null,"AGENCIA BASADRE","Lima",12]
[null,0,0,0,null,"AGENCIA BELAUNDE","Lima",21]
[null,0,0,0,null,"AGENCIA BRASIL","Lima",221]
[null,0,0,0,null,"AGENCIA C.C OPEN PLAZA ATOCONGO","Lima",685]
[null,0,0,0,null,"AGENCIA C.C REAL PLAZA PRO","Lima",702]
[null,0,0,0,null,"AGENCIA CALLAO","Lima",100]
[null,0,0,0,null,"AGENCIA CAMACHO","Lima",97]
[null,0,0,0,null,"AGENCIA CAMANA","Lima",81]
[null,0,0,0,null,"AGENCIA CAMINO REAL","Lima",234]
[null,0,0,0,null,"AGENCIA CAMINOS DEL INCA","Lima",430]
[null,0,0,0,null,"AGENCIA CAMPO DE MARTE","Lima",210]
[null,0,0,0,null,"AGENCIA CANTO GRANDE","Lima",691]
[null,0,0,0,null,"AGENCIA CAPON","Lima",11]
[null,0,0,0,null,"AGENCIA CAQUETA","Lima",679]
[null,0,0,0,null,"AGENCIA CENTRO AERO COMERCIAL","Lima",248]
{"$rows_left_out":479}
{"sheet":"Hoja2","index":8,"n_rows":0,"n_cols":0,"rows_kept":0,"cut":false,"hidden":true,"merged":[]}

{"sheet":"Hoja3","index":9,"n_rows":0,"n_cols":0,"rows_kept":0,"cut":false,"hidden":true,"merged":[]}

{"sheet":"Profesion","index":10,"n_rows":149,"n_cols":10,"rows_kept":149,"cut":false,"hidden":true,"merged":[]}
[]
[null,null,"Argumento  ","Descripcion             ",null,"Argumento  ","Descripcion          ",null,"Codigo ","Profesión"]
[null,null,0,"TIPO DE OCUPACION    ",null,0,"   CARGO ACTUAL     ",null,1,"AUXILIAR DE ADMINISTRACION             "]
[null,null,1,"DEPENDIENTE             ",null,1,"GERENTE GENERAL      ",null,2,"ANTROPOLOGO, ARQUEOLOGO Y ETNOLOGO     "]
[null,null,2,"INDEPENDIENTE           ",null,2,"GERENTE PRODUCCION    ",null,3,"ABOGADO                                "]
[null,null,3,"ESTUDIANTE              ",null,3,"GERENTE RR.HH        ",null,4,"AMA DE CASA                            "]
[null,null,4,"JUBILADO                ",null,4,"GERENTE FINANZAS     ",null,5,"ACTOR,ARTISTA Y DIRECTOR DE ESPECTACULOS"]
[null,null,5,"SU CASA                 ",null,5,"GERENTE INFORMATICA  ",null,6,"ADMINISTRADOR                          "]
[null,null,7,"RENTISTA                ",null,6,"EMPLEADO             ",null,7,"ADMINISTRADOR DE EMPRESAS(PROFESIONAL) "]
[null,null,8,"OTROS - BACK      OFFICE",null,7,"FUNCIONARIO          ",null,8,"AGRICULTOR                             "]
[null,null,null,null,null,8,"GERENTE              ",null,9,"AGRONOMO                               "]
[null,null,null,null,null,9,"GERENTE MARKETING    ",null,10,"AGRIMENSOR Y TOPOGRAFO                 "]
[null,null,null,null,null,10,"GERENTE OPERACIONES  ",null,11,"ALBA¥IL                                "]
[null,null,null,null,null,11,"GERENTE PRODUCTOS    ",null,12,"ARCHIVERO                              "]
[null,null,null,null,null,12,"GERENTE VENTAS       ",null,13,"ARQUITECTO                             "]
[null,null,null,null,null,13,"JEFE                 ",null,14,"ANALISTAS DE SISTEMA Y COMPUTACION     "]
[null,null,null,null,null,14,"SUB GERENTE          ",null,15,"ASESOR                                 "]
[null,null,null,null,null,15,"OTROS                ",null,16,"ARTESANO DE CUERO"]
[null,null,null,null,null,16,"GERENTE ADMINISTRACION",null,17,"ARTESANO TEXTIL"]
[null,null,null,null,null,17,"CONTADOR GENERAL     ",null,18,"BACTERIOLOGO, FARMACOLOGO"]
[null,null,null,null,null,18,"AUDITOR INTERNO      ",null,19,"BIOLOGO"]
[null,null,null,null,null,19,"NO INFORMADO         ",null,20,"COMERCIALIZACION DE ARROZ"]
[null,null,null,null,null,20,"ASESOR               ",null,21,"CAMBISTA"]
[null,null,null,null,null,21,"PRACTICANTE        ",null,22,"FOTOGRAFO Y OPERADORES CAMARA, CINE Y TV"]
[null,null,null,null,null,null,null,null,23,"CIRUJANO PLASTICO"]
[null,null,null,null,null,null,null,null,24,"COREOGRAFO Y BAILARINES"]
[null,null,null,null,null,null,null,null,26,"COSMETOLOGO, PELUQUERO Y BARBERO"]
[null,null,null,null,null,null,null,null,27,"CARPINTERO"]
[null,null,null,null,null,null,null,null,28,"CONFECCIONISTA DE ROPA"]
[null,null,null,null,null,null,null,null,29,"CONSULTOR"]
{"$rows_left_out":120}
{"sheet":"Ocupacion","index":11,"n_rows":0,"n_cols":0,"rows_kept":0,"cut":false,"hidden":true,"merged":[]}